[Bug 300012] Re: package flashplugin-nonfree 10.0.12.36ubuntu1 failed to install/upgrade: el subproceso post-installation script devolvi? el c?digo de salida de error 1
Jean-Baptiste Lallement
jeanbaptiste.lallement at gmail.com
Thu Nov 20 13:15:39 UTC 2008
Thanks for your report.
The cause of the failure is
====
Download done.
Flash Plugin installed.
/usr/lib/nspluginwrapper/i386/linux/npviewer.bin: error while loading shared libraries: libgtk-x11-2.0.so.0: cannot open shared object file: No such file or directory
nspluginwrapper: no appropriate viewer found for /usr/lib/flashplugin-nonfree/libflashplayer.so
dpkg: error al procesar flashplugin-nonfree (--configure):
el subproceso post-installation script devolvió el código de salida de error 1
====
Opening nspluginwrapper task.
** Also affects: nspluginwrapper (Ubuntu)
Importance: Undecided
Status: New
** Summary changed:
- package flashplugin-nonfree 10.0.12.36ubuntu1 failed to install/upgrade: el subproceso post-installation script devolvi? el c?digo de salida de error 1
+ flashplugin-nonfree failed to install/upgrade: /usr/lib/nspluginwrapper/i386/linux/npviewer.bin: error while loading shared libraries: libgtk-x11-2.0.so.0: cannot open shared object file: No such file or directory
--
flashplugin-nonfree failed to install/upgrade: /usr/lib/nspluginwrapper/i386/linux/npviewer.bin: error while loading shared libraries: libgtk-x11-2.0.so.0: cannot open shared object file: No such file or directory
https://bugs.launchpad.net/bugs/300012
You received this bug notification because you are a member of Mozilla
Bugs, which is subscribed to flashplugin-nonfree in ubuntu.
More information about the Ubuntu-mozillateam-bugs
mailing list