Log for failed build of python-cddb_1.4-5.1build2 (dist=jaunty-autotest)

Build Daemon user noreply at buildd.ubuntu.com
Fri Apr 10 06:47:37 BST 2009


Automatic build of python-cddb_1.4-5.1build2 on king by sbuild/amd64 1.170.5
Build started at 20090410-0646
******************************************************************************
Checking available source versions...
Fetching source files...
Reading package lists...
Building dependency tree...
Reading state information...
Need to get 47.1kB of source archives.
Get:1 http://archive.internal jaunty-autotest/main python-cddb 1.4-5.1build2 (dsc) [1068B]
Get:2 http://archive.internal jaunty-autotest/main python-cddb 1.4-5.1build2 (tar) [38.4kB]
Get:3 http://archive.internal jaunty-autotest/main python-cddb 1.4-5.1build2 (diff) [7591B]
Fetched 47.1kB in 0s (1614kB/s)
Download complete and in download only mode
** Using build dependencies supplied by package:
Build-Depends: cdbs (>= 0.4.43), debhelper (>= 5.0.37.2), python-all-dev (>= 2.3.5-11), python-support (>= 0.3)
Checking for already installed source dependencies...
cdbs: missing
debhelper: missing
python-all-dev: missing
python-support: missing
Checking for source dependency conflicts...
  /usr/bin/sudo /usr/bin/apt-get --purge $CHROOT_OPTIONS -q -y install cdbs debhelper python-all-dev python-support
Reading package lists...
Building dependency tree...
Reading state information...
The following extra packages will be installed:
  autoconf automake autotools-dev bsdmainutils fdupes file gettext
  gettext-base groff-base html2text intltool intltool-debian libcroco3
  libexpat1 libglib2.0-0 libhtml-parser-perl libhtml-tagset-perl
  libhtml-tree-perl libmagic1 libncursesw5 libpython2.6 libreadline5
  libsqlite3-0 libssl0.9.8 liburi-perl libwww-perl libxml-parser-perl libxml2
  m4 man-db mime-support netbase po-debconf python python-all python-dev
  python2.5 python2.5-dev python2.5-minimal python2.6 python2.6-dev
  readline-common
Suggested packages:
  autoconf2.13 autobook autoconf-archive gnu-standards autoconf-doc libtool
  wamerican wordlist whois vacation devscripts doc-base dh-make cvs
  gettext-doc groff libdata-dump-perl libio-socket-ssl-perl less www-browser
  libmail-box-perl python-doc python-tk python-profiler python2.5-doc
  binfmt-support python2.6-doc python2.6-profiler
Recommended packages:
  curl wget lynx libglib2.0-data shared-mime-info libgpm2 libmailtools-perl
  libhtml-format-perl libcompress-zlib-perl xml-core ifupdown
  libmail-sendmail-perl
The following NEW packages will be installed:
  autoconf automake autotools-dev bsdmainutils cdbs debhelper fdupes file
  gettext gettext-base groff-base html2text intltool intltool-debian libcroco3
  libexpat1 libglib2.0-0 libhtml-parser-perl libhtml-tagset-perl
  libhtml-tree-perl libmagic1 libncursesw5 libpython2.6 libreadline5
  libsqlite3-0 libssl0.9.8 liburi-perl libwww-perl libxml-parser-perl libxml2
  m4 man-db mime-support netbase po-debconf python python-all python-all-dev
  python-dev python-support python2.5 python2.5-dev python2.5-minimal
  python2.6 python2.6-dev readline-common
0 upgraded, 46 newly installed, 0 to remove and 0 not upgraded.
Need to get 0B/28.7MB of archives.
After this operation, 90.9MB of additional disk space will be used.
WARNING: The following packages cannot be authenticated!
  libmagic1 file libncursesw5 readline-common libreadline5 libsqlite3-0
  libssl0.9.8 mime-support netbase python2.6 python bsdmainutils gettext-base
  groff-base libexpat1 libhtml-tagset-perl liburi-perl libhtml-parser-perl
  libhtml-tree-perl libwww-perl libxml-parser-perl libxml2 man-db
  python-support m4 autoconf autotools-dev automake html2text libglib2.0-0
  libcroco3 gettext intltool-debian po-debconf debhelper fdupes intltool cdbs
  libpython2.6 python2.5-minimal python2.5 python-all python2.6-dev python-dev
  python2.5-dev python-all-dev
debconf: unable to initialize frontend: Dialog
debconf: (Dialog frontend will not work on a dumb terminal, an emacs shell buffer, or without a controlling terminal.)
debconf: falling back to frontend: Readline
debconf: unable to initialize frontend: Readline
debconf: (This frontend requires a controlling tty.)
debconf: falling back to frontend: Teletype
dpkg-preconfigure: unable to re-open stdin: 
Authentication warning overridden.
Selecting previously deselected package libmagic1.
(Reading database ... 9812 files and directories currently installed.)
Unpacking libmagic1 (from .../libmagic1_4.26-2ubuntu3_amd64.deb) ...
Selecting previously deselected package file.
Unpacking file (from .../file_4.26-2ubuntu3_amd64.deb) ...
Selecting previously deselected package libncursesw5.
Unpacking libncursesw5 (from .../libncursesw5_5.7+20090207-1ubuntu1_amd64.deb) ...
Selecting previously deselected package readline-common.
Unpacking readline-common (from .../readline-common_5.2-4_all.deb) ...
Selecting previously deselected package libreadline5.
Unpacking libreadline5 (from .../libreadline5_5.2-4_amd64.deb) ...
Selecting previously deselected package libsqlite3-0.
Unpacking libsqlite3-0 (from .../libsqlite3-0_3.6.10-1_amd64.deb) ...
Selecting previously deselected package libssl0.9.8.
Unpacking libssl0.9.8 (from .../libssl0.9.8_0.9.8g-15ubuntu3_amd64.deb) ...
Selecting previously deselected package mime-support.
Unpacking mime-support (from .../mime-support_3.44-1_all.deb) ...
Selecting previously deselected package netbase.
Unpacking netbase (from .../netbase_4.34ubuntu2_all.deb) ...
Selecting previously deselected package python2.6.
Unpacking python2.6 (from .../python2.6_2.6.2~rc1-0ubuntu1_amd64.deb) ...
Selecting previously deselected package python.
Unpacking python (from .../python_2.6.1-0ubuntu9_all.deb) ...
Selecting previously deselected package bsdmainutils.
Unpacking bsdmainutils (from .../bsdmainutils_6.1.10ubuntu3_amd64.deb) ...
Selecting previously deselected package gettext-base.
Unpacking gettext-base (from .../gettext-base_0.17-6ubuntu2_amd64.deb) ...
Selecting previously deselected package groff-base.
Unpacking groff-base (from .../groff-base_1.18.1.1-22build1_amd64.deb) ...
Selecting previously deselected package libexpat1.
Unpacking libexpat1 (from .../libexpat1_2.0.1-4_amd64.deb) ...
Selecting previously deselected package libhtml-tagset-perl.
Unpacking libhtml-tagset-perl (from .../libhtml-tagset-perl_3.20-2_all.deb) ...
Selecting previously deselected package liburi-perl.
Unpacking liburi-perl (from .../liburi-perl_1.37+dfsg-1ubuntu1_all.deb) ...
Selecting previously deselected package libhtml-parser-perl.
Unpacking libhtml-parser-perl (from .../libhtml-parser-perl_3.59-1ubuntu1_amd64.deb) ...
Selecting previously deselected package libhtml-tree-perl.
Unpacking libhtml-tree-perl (from .../libhtml-tree-perl_3.23-1_all.deb) ...
Selecting previously deselected package libwww-perl.
Unpacking libwww-perl (from .../libwww-perl_5.820-1_all.deb) ...
Selecting previously deselected package libxml-parser-perl.
Unpacking libxml-parser-perl (from .../libxml-parser-perl_2.36-1.1build2_amd64.deb) ...
Selecting previously deselected package libxml2.
Unpacking libxml2 (from .../libxml2_2.6.32.dfsg-5ubuntu4_amd64.deb) ...
Selecting previously deselected package man-db.
Unpacking man-db (from .../man-db_2.5.5-1build1_amd64.deb) ...
Selecting previously deselected package python-support.
Unpacking python-support (from .../python-support_0.8.7ubuntu3_all.deb) ...
Selecting previously deselected package m4.
Unpacking m4 (from .../archives/m4_1.4.11-1_amd64.deb) ...
Selecting previously deselected package autoconf.
Unpacking autoconf (from .../autoconf_2.63-2ubuntu1_all.deb) ...
Selecting previously deselected package autotools-dev.
Unpacking autotools-dev (from .../autotools-dev_20080123.2_all.deb) ...
Selecting previously deselected package automake.
Unpacking automake (from .../automake_1%3a1.10.2-0ubuntu2_all.deb) ...
Selecting previously deselected package html2text.
Unpacking html2text (from .../html2text_1.3.2a-5_amd64.deb) ...
Selecting previously deselected package libglib2.0-0.
Unpacking libglib2.0-0 (from .../libglib2.0-0_2.20.0-1build2_amd64.deb) ...
Selecting previously deselected package libcroco3.
Unpacking libcroco3 (from .../libcroco3_0.6.1-2_amd64.deb) ...
Selecting previously deselected package gettext.
Unpacking gettext (from .../gettext_0.17-6ubuntu2_amd64.deb) ...
Selecting previously deselected package intltool-debian.
Unpacking intltool-debian (from .../intltool-debian_0.35.0+20060710.1_all.deb) ...
Selecting previously deselected package po-debconf.
Unpacking po-debconf (from .../po-debconf_1.0.15ubuntu1_all.deb) ...
Selecting previously deselected package debhelper.
Unpacking debhelper (from .../debhelper_7.0.17ubuntu4_all.deb) ...
Selecting previously deselected package fdupes.
Unpacking fdupes (from .../fdupes_1.50-PR2-1_amd64.deb) ...
Selecting previously deselected package intltool.
Unpacking intltool (from .../intltool_0.40.6-1_all.deb) ...
Selecting previously deselected package cdbs.
Unpacking cdbs (from .../cdbs_0.4.52ubuntu18_all.deb) ...
Selecting previously deselected package libpython2.6.
Unpacking libpython2.6 (from .../libpython2.6_2.6.2~rc1-0ubuntu1_amd64.deb) ...
Selecting previously deselected package python2.5-minimal.
Unpacking python2.5-minimal (from .../python2.5-minimal_2.5.4-1ubuntu4_amd64.deb) ...
Selecting previously deselected package python2.5.
Unpacking python2.5 (from .../python2.5_2.5.4-1ubuntu4_amd64.deb) ...
Selecting previously deselected package python-all.
Unpacking python-all (from .../python-all_2.6.1-0ubuntu9_all.deb) ...
Selecting previously deselected package python2.6-dev.
Unpacking python2.6-dev (from .../python2.6-dev_2.6.2~rc1-0ubuntu1_amd64.deb) ...
Selecting previously deselected package python-dev.
Unpacking python-dev (from .../python-dev_2.6.1-0ubuntu9_all.deb) ...
Selecting previously deselected package python2.5-dev.
Unpacking python2.5-dev (from .../python2.5-dev_2.5.4-1ubuntu4_amd64.deb) ...
Selecting previously deselected package python-all-dev.
Unpacking python-all-dev (from .../python-all-dev_2.6.1-0ubuntu9_all.deb) ...
Setting up libmagic1 (4.26-2ubuntu3) ...

Setting up file (4.26-2ubuntu3) ...
Setting up libncursesw5 (5.7+20090207-1ubuntu1) ...

Setting up readline-common (5.2-4) ...

Setting up libreadline5 (5.2-4) ...

Setting up libsqlite3-0 (3.6.10-1) ...

Setting up libssl0.9.8 (0.9.8g-15ubuntu3) ...

Setting up mime-support (3.44-1) ...

Setting up netbase (4.34ubuntu2) ...

Setting up python2.6 (2.6.2~rc1-0ubuntu1) ...

Setting up python (2.6.1-0ubuntu9) ...

Setting up bsdmainutils (6.1.10ubuntu3) ...

Setting up gettext-base (0.17-6ubuntu2) ...

Setting up groff-base (1.18.1.1-22build1) ...

Setting up libexpat1 (2.0.1-4) ...

Setting up libhtml-tagset-perl (3.20-2) ...
Setting up liburi-perl (1.37+dfsg-1ubuntu1) ...

Setting up libhtml-parser-perl (3.59-1ubuntu1) ...

Setting up libhtml-tree-perl (3.23-1) ...
Setting up libwww-perl (5.820-1) ...
Setting up libxml-parser-perl (2.36-1.1build2) ...
Setting up libxml2 (2.6.32.dfsg-5ubuntu4) ...

Setting up man-db (2.5.5-1build1) ...
Building database of manual pages ...
... skipping, since this is a buildd

Setting up python-support (0.8.7ubuntu3) ...

Setting up m4 (1.4.11-1) ...

Setting up autoconf (2.63-2ubuntu1) ...

Setting up autotools-dev (20080123.2) ...
Setting up automake (1:1.10.2-0ubuntu2) ...

Setting up html2text (1.3.2a-5) ...

Setting up libglib2.0-0 (2.20.0-1build2) ...

Setting up libcroco3 (0.6.1-2) ...

Setting up gettext (0.17-6ubuntu2) ...

Setting up intltool-debian (0.35.0+20060710.1) ...
Setting up po-debconf (1.0.15ubuntu1) ...

Setting up debhelper (7.0.17ubuntu4) ...

Setting up fdupes (1.50-PR2-1) ...
Setting up intltool (0.40.6-1) ...
Setting up cdbs (0.4.52ubuntu18) ...

Setting up libpython2.6 (2.6.2~rc1-0ubuntu1) ...

Setting up python2.5-minimal (2.5.4-1ubuntu4) ...
Linking and byte-compiling packages for runtime python2.5...

Setting up python2.5 (2.5.4-1ubuntu4) ...

Setting up python-all (2.6.1-0ubuntu9) ...
Setting up python2.6-dev (2.6.2~rc1-0ubuntu1) ...
Setting up python-dev (2.6.1-0ubuntu9) ...
Setting up python2.5-dev (2.5.4-1ubuntu4) ...
Setting up python-all-dev (2.6.1-0ubuntu9) ...
Processing triggers for libc6 ...
ldconfig deferred processing now taking place
Checking correctness of source dependencies...
Toolchain package versions: libc6-dev_2.9-4ubuntu6 make_3.81-5 dpkg-dev_1.14.24ubuntu1 linux-libc-dev_2.6.28-11.41 g++-4.3_4.3.3-5ubuntu4 gcc-4.3_4.3.3-5ubuntu4 binutils_2.19.1-0ubuntu3 libstdc++6_4.3.3-5ubuntu4 libstdc++6-4.3-dev_4.3.3-5ubuntu4
------------------------------------------------------------------------------
sh: gcc: not found
dpkg-source: warning: Couldn't determine gcc system type, falling back to default (native compilation)
gpg: Signature made Mon Feb 23 15:56:11 2009 GMT using DSA key ID 0F932C9C
gpg: Can't check signature: public key not found
dpkg-source: extracting python-cddb in python-cddb-1.4
dpkg-source: unpacking python-cddb_1.4.orig.tar.gz
dpkg-source: applying /home/buildd/build-jaunty-autotest/python-cddb_1.4-5.1build2.diff.gz
dpkg-buildpackage: set CFLAGS to default value: -g -O2
dpkg-buildpackage: set CPPFLAGS to default value: 
dpkg-buildpackage: set LDFLAGS to default value: -Wl,-Bsymbolic-functions
dpkg-buildpackage: set FFLAGS to default value: -g -O2
dpkg-buildpackage: set CXXFLAGS to default value: -g -O2
dpkg-buildpackage: source package python-cddb
dpkg-buildpackage: source version 1.4-5.1build2
dpkg-buildpackage: host architecture amd64
 /usr/bin/fakeroot debian/rules clean
pyversions: missing XS-Python-Version in control file, fall back to debian/pyversions
pyversions: missing debian/pyversions file, fall back to supported versions
test -x debian/rules
test "`id -u`" = 0
/usr/bin/make -f debian/rules reverse-config
pyversions: missing XS-Python-Version in control file, fall back to debian/pyversions
pyversions: missing debian/pyversions file, fall back to supported versions
make[1]: Entering directory `/build/buildd/python-cddb-1.4'
make[1]: Nothing to be done for `reverse-config'.
make[1]: Leaving directory `/build/buildd/python-cddb-1.4'
if [ "reverse-patches" = "reverse-patches" ]; then rm -f debian/stamp-patched; fi
patches: debian/patches/01_integer_python2.4_fix.diff debian/patches/02_kfreebsd.diff debian/patches/03_double_free_fix.diff debian/patches/upstream-1.3-to-1.4.diff
Patch debian/patches/upstream-1.3-to-1.4.diff is not applied.
Patch debian/patches/03_double_free_fix.diff is not applied.
Patch debian/patches/02_kfreebsd.diff is not applied.
Patch debian/patches/01_integer_python2.4_fix.diff is not applied.
if [ "reverse-patches" != "reverse-patches" ]; then touch debian/stamp-patched; fi
if [ "reverse-patches" != "reverse-patches" ] ; then \
		/usr/bin/make -f debian/rules update-config ; \
	fi
for dir in debian/patches ; do \
	    rm -f $dir/*.log ; \
	done
dh_clean 
cd . && python2.5 setup.py clean -a
running clean
'build/lib.linux-x86_64-2.5' does not exist -- can't clean it
'build/bdist.linux-x86_64' does not exist -- can't clean it
'build/scripts-2.5' does not exist -- can't clean it
cd . && python setup.py clean -a
running clean
'build/lib.linux-x86_64-2.6' does not exist -- can't clean it
'build/bdist.linux-x86_64' does not exist -- can't clean it
'build/scripts-2.6' does not exist -- can't clean it
rm -f python-build-stamp-*
find . -name '*.pyc' -exec rm '{}' ';'
 debian/rules build
pyversions: missing XS-Python-Version in control file, fall back to debian/pyversions
pyversions: missing debian/pyversions file, fall back to supported versions
test -x debian/rules
mkdir -p "."
/usr/bin/make -f debian/rules reverse-config
pyversions: missing XS-Python-Version in control file, fall back to debian/pyversions
pyversions: missing debian/pyversions file, fall back to supported versions
make[1]: Entering directory `/build/buildd/python-cddb-1.4'
make[1]: Nothing to be done for `reverse-config'.
make[1]: Leaving directory `/build/buildd/python-cddb-1.4'
if [ "debian/stamp-patched" = "reverse-patches" ]; then rm -f debian/stamp-patched; fi
patches: debian/patches/01_integer_python2.4_fix.diff debian/patches/02_kfreebsd.diff debian/patches/03_double_free_fix.diff debian/patches/upstream-1.3-to-1.4.diff
Trying patch debian/patches/01_integer_python2.4_fix.diff at level 1 ... 0 ... success.
Trying patch debian/patches/02_kfreebsd.diff at level 1 ... success.
Trying patch debian/patches/03_double_free_fix.diff at level 1 ... 0 ... success.
Trying patch debian/patches/upstream-1.3-to-1.4.diff at level 1 ... success.
if [ "debian/stamp-patched" != "reverse-patches" ]; then touch debian/stamp-patched; fi
if [ "debian/stamp-patched" != "reverse-patches" ] ; then \
		/usr/bin/make -f debian/rules update-config ; \
	fi
pyversions: missing XS-Python-Version in control file, fall back to debian/pyversions
pyversions: missing debian/pyversions file, fall back to supported versions
make[1]: Entering directory `/build/buildd/python-cddb-1.4'
make[1]: Nothing to be done for `update-config'.
make[1]: Leaving directory `/build/buildd/python-cddb-1.4'
cd . && python2.5 setup.py build --build-base="/build/buildd/python-cddb-1.4/./build"
running build
running build_py
creating /build/buildd/python-cddb-1.4/build
creating /build/buildd/python-cddb-1.4/build/lib.linux-x86_64-2.5
copying CDDB.py -> /build/buildd/python-cddb-1.4/./build/lib.linux-x86_64-2.5
copying DiscID.py -> /build/buildd/python-cddb-1.4/./build/lib.linux-x86_64-2.5
running build_ext
building 'cdrom' extension
creating /build/buildd/python-cddb-1.4/build/temp.linux-x86_64-2.5
creating /build/buildd/python-cddb-1.4/build/temp.linux-x86_64-2.5/unix
gcc -pthread -fno-strict-aliasing -DNDEBUG -g -fwrapv -O2 -Wall -Wstrict-prototypes -g -O2 -g -Wall -O2 -fPIC -I/usr/include/python2.5 -c unix/cdrommodule.c -o /build/buildd/python-cddb-1.4/./build/temp.linux-x86_64-2.5/unix/cdrommodule.o
gcc -pthread -shared -Wl,-O1 -Wl,-Bsymbolic-functions -Wl,-Bsymbolic-functions -g -O2 -g -Wall -O2 /build/buildd/python-cddb-1.4/./build/temp.linux-x86_64-2.5/unix/cdrommodule.o -o /build/buildd/python-cddb-1.4/./build/lib.linux-x86_64-2.5/cdrom.so
touch python-build-stamp-2.5
cd . && python setup.py build --build-base="/build/buildd/python-cddb-1.4/./build"
running build
running build_py
creating /build/buildd/python-cddb-1.4/build/lib.linux-x86_64-2.6
copying CDDB.py -> /build/buildd/python-cddb-1.4/./build/lib.linux-x86_64-2.6
copying DiscID.py -> /build/buildd/python-cddb-1.4/./build/lib.linux-x86_64-2.6
running build_ext
building 'cdrom' extension
creating /build/buildd/python-cddb-1.4/build/temp.linux-x86_64-2.6
creating /build/buildd/python-cddb-1.4/build/temp.linux-x86_64-2.6/unix
gcc -pthread -fno-strict-aliasing -DNDEBUG -g -fwrapv -O2 -Wall -Wstrict-prototypes -g -O2 -g -Wall -O2 -fPIC -I/usr/include/python2.6 -c unix/cdrommodule.c -o /build/buildd/python-cddb-1.4/./build/temp.linux-x86_64-2.6/unix/cdrommodule.o
gcc -pthread -shared -Wl,-O1 -Wl,-Bsymbolic-functions -Wl,-Bsymbolic-functions -g -O2 -g -Wall -O2 /build/buildd/python-cddb-1.4/./build/temp.linux-x86_64-2.6/unix/cdrommodule.o -o /build/buildd/python-cddb-1.4/./build/lib.linux-x86_64-2.6/cdrom.so
touch python-build-stamp-2.6
 /usr/bin/fakeroot debian/rules binary-arch
pyversions: missing XS-Python-Version in control file, fall back to debian/pyversions
pyversions: missing debian/pyversions file, fall back to supported versions
test -x debian/rules
test "`id -u`" = 0
dh_clean -k 
dh_installdirs -A 
mkdir -p "."
cd . && python2.5 setup.py install --root=/build/buildd/python-cddb-1.4/debian/python-cddb/ --no-compile -O0 --install-layout=deb
running install
running build
running build_py
running build_ext
running install_lib
creating /build/buildd/python-cddb-1.4/debian/python-cddb/usr
creating /build/buildd/python-cddb-1.4/debian/python-cddb/usr/lib
creating /build/buildd/python-cddb-1.4/debian/python-cddb/usr/lib/python2.5
creating /build/buildd/python-cddb-1.4/debian/python-cddb/usr/lib/python2.5/site-packages
copying build/lib.linux-x86_64-2.5/CDDB.py -> /build/buildd/python-cddb-1.4/debian/python-cddb/usr/lib/python2.5/site-packages
copying build/lib.linux-x86_64-2.5/DiscID.py -> /build/buildd/python-cddb-1.4/debian/python-cddb/usr/lib/python2.5/site-packages
copying build/lib.linux-x86_64-2.5/cdrom.so -> /build/buildd/python-cddb-1.4/debian/python-cddb/usr/lib/python2.5/site-packages
running install_egg_info
Writing /build/buildd/python-cddb-1.4/debian/python-cddb/usr/lib/python2.5/site-packages/CDDB-1.4.egg-info
cd . && python setup.py install --root=/build/buildd/python-cddb-1.4/debian/python-cddb/ --no-compile -O0 --install-layout=deb
running install
running build
running build_py
running build_ext
running install_lib
creating /build/buildd/python-cddb-1.4/debian/python-cddb/usr/lib/python2.6
creating /build/buildd/python-cddb-1.4/debian/python-cddb/usr/lib/python2.6/dist-packages
copying build/lib.linux-x86_64-2.6/CDDB.py -> /build/buildd/python-cddb-1.4/debian/python-cddb/usr/lib/python2.6/dist-packages
copying build/lib.linux-x86_64-2.6/DiscID.py -> /build/buildd/python-cddb-1.4/debian/python-cddb/usr/lib/python2.6/dist-packages
copying build/lib.linux-x86_64-2.6/cdrom.so -> /build/buildd/python-cddb-1.4/debian/python-cddb/usr/lib/python2.6/dist-packages
running install_egg_info
Writing /build/buildd/python-cddb-1.4/debian/python-cddb/usr/lib/python2.6/dist-packages/CDDB-1.4.egg-info
dh_installdirs -ppython-cddb 
dh_installdocs -ppython-cddb ./README  
dh_installexamples -ppython-cddb 
dh_installman -ppython-cddb  
dh_installinfo -ppython-cddb  
dh_installmenu -ppython-cddb 
dh_installcron -ppython-cddb 
dh_installinit -ppython-cddb   
dh_installdebconf -ppython-cddb 
dh_installemacsen -ppython-cddb   
dh_installcatalogs -ppython-cddb 
dh_installpam -ppython-cddb 
dh_installlogrotate -ppython-cddb 
dh_installlogcheck -ppython-cddb 
dh_installchangelogs -ppython-cddb   
dh_installudev -ppython-cddb 
dh_lintian -ppython-cddb 
dh_install -ppython-cddb  
dh_link -ppython-cddb  
dh_installmime -ppython-cddb 
dh_pysupport -ppython-cddb 
Traceback (most recent call last):
  File "/usr/bin/pysupport-movemodules", line 137, in <module>
    do_move (basedir, package, "usr/lib", "site-packages")
  File "/usr/bin/pysupport-movemodules", line 78, in do_move
    file_dict.addsum(relfile,pyvers,md5.new(file(absfile).read()).digest())
AttributeError: 'builtin_function_or_method' object has no attribute 'new'
dh_pysupport: command returned error code 256
make: *** [binary-install/python-cddb] Error 1
dpkg-buildpackage: failure: /usr/bin/fakeroot debian/rules binary-arch gave error exit status 2
******************************************************************************
Build finished at 20090410-0647
FAILED [dpkg-buildpackage died]
Purging chroot-jaunty-autotest/build/buildd/python-cddb-1.4
------------------------------------------------------------------------------
  /usr/bin/sudo dpkg --root=/home/buildd/build-jaunty-autotest/chroot-jaunty-autotest --purge groff-base libglib2.0-0 mime-support m4 readline-common gettext file libhtml-parser-perl intltool python2.5 libwww-perl liburi-perl python2.5-minimal libhtml-tree-perl autotools-dev po-debconf python2.6 libxml-parser-perl libcroco3 libhtml-tagset-perl python-support libxml2 netbase libpython2.6 automake python-all-dev python-all python-dev man-db libssl0.9.8 intltool-debian cdbs html2text gettext-base python2.6-dev debhelper python libmagic1 libreadline5 libexpat1 libsqlite3-0 python2.5-dev bsdmainutils fdupes autoconf libncursesw5
(Reading database ... 13382 files and directories currently installed.)
Removing python-support ...
Purging configuration files for python-support ...
Removing python-all-dev ...
Removing python-all ...
Removing python-dev ...
Removing cdbs ...
Removing python2.6-dev ...
Removing debhelper ...
Removing python ...
Purging configuration files for python ...
Removing python2.5-dev ...
Removing fdupes ...
Removing intltool ...
Removing python2.5 ...
Purging configuration files for python2.5 ...
Removing python2.5-minimal ...
Unlinking and removing bytecode for runtime python2.5
Purging configuration files for python2.5-minimal ...
Removing po-debconf ...
Removing libxml-parser-perl ...
Removing libpython2.6 ...
Purging configuration files for libpython2.6 ...
Removing automake ...
Removing man-db ...
Purging configuration files for man-db ...
  Removing catpages as well as /var/cache/man hierarchy.
dpkg - warning: while removing man-db, directory `/usr/share/doc/man-db/examples' not empty so not removed.
dpkg - warning: while removing man-db, directory `/usr/share/doc/man-db' not empty so not removed.
dpkg - warning: while removing man-db, directory `/usr/share/man-db' not empty so not removed.
dpkg - warning: while removing man-db, directory `/usr/share/bug/man-db' not empty so not removed.
dpkg - warning: while removing man-db, directory `/usr/lib/man-db' not empty so not removed.
Removing intltool-debian ...
Removing html2text ...
Purging configuration files for html2text ...
Removing libexpat1 ...
Purging configuration files for libexpat1 ...
Removing bsdmainutils ...
Purging configuration files for bsdmainutils ...
Removing autoconf ...
Purging configuration files for autoconf ...
Removing groff-base ...
Purging configuration files for groff-base ...
Removing m4 ...
Removing gettext ...
Removing file ...
Purging configuration files for file ...
Removing libwww-perl ...
Removing libhtml-tree-perl ...
Removing autotools-dev ...
Removing python2.6 ...
Purging configuration files for python2.6 ...
dpkg - warning: while removing python2.6, directory `/usr/share/applications' not empty so not removed.
Removing libcroco3 ...
Purging configuration files for libcroco3 ...
Removing libxml2 ...
Purging configuration files for libxml2 ...
Removing netbase ...
Purging configuration files for netbase ...
Removing libssl0.9.8 ...
Purging configuration files for libssl0.9.8 ...
Removing gettext-base ...
Removing libmagic1 ...
Purging configuration files for libmagic1 ...
Removing libreadline5 ...
Purging configuration files for libreadline5 ...
Removing libsqlite3-0 ...
Purging configuration files for libsqlite3-0 ...
Removing libncursesw5 ...
Purging configuration files for libncursesw5 ...
Removing libglib2.0-0 ...
Purging configuration files for libglib2.0-0 ...
Removing mime-support ...
Purging configuration files for mime-support ...
Removing readline-common ...
Purging configuration files for readline-common ...
Removing libhtml-parser-perl ...
Removing liburi-perl ...
Removing libhtml-tagset-perl ...
Processing triggers for libc6 ...
ldconfig deferred processing now taking place
******************************************************************************
Finished at 20090410-0647
Build needed 00:00:07, 580k disk space




More information about the ubuntu-autotest mailing list