Log for failed build of python-adns_1.1.1-0ubuntu2 (dist=jaunty-autotest)

Build Daemon user noreply at buildd.ubuntu.com
Fri Apr 10 06:46:23 BST 2009


Automatic build of python-adns_1.1.1-0ubuntu2 on king by sbuild/amd64 1.170.5
Build started at 20090410-0645
******************************************************************************
Checking available source versions...
Fetching source files...
Reading package lists...
Building dependency tree...
Reading state information...
Need to get 21.0kB of source archives.
Get:1 http://archive.internal jaunty-autotest/main python-adns 1.1.1-0ubuntu2 (dsc) [1183B]
Get:2 http://archive.internal jaunty-autotest/main python-adns 1.1.1-0ubuntu2 (tar) [16.4kB]
Get:3 http://archive.internal jaunty-autotest/main python-adns 1.1.1-0ubuntu2 (diff) [3407B]
Fetched 21.0kB in 0s (1037kB/s)
Download complete and in download only mode
** Using build dependencies supplied by package:
Build-Depends: debhelper (>= 5.0.37.2), python-all-dev (>= 2.3.5-11), python-support (>= 0.3.2), libadns1-dev
Checking for already installed source dependencies...
debhelper: missing
python-all-dev: missing
python-support: missing
libadns1-dev: missing
Checking for source dependency conflicts...
  /usr/bin/sudo /usr/bin/apt-get --purge $CHROOT_OPTIONS -q -y install debhelper python-all-dev python-support libadns1-dev
Reading package lists...
Building dependency tree...
Reading state information...
The following extra packages will be installed:
  bsdmainutils file gettext gettext-base groff-base html2text intltool-debian
  libadns1 libcroco3 libglib2.0-0 libmagic1 libncursesw5 libpython2.6
  libreadline5 libsqlite3-0 libssl0.9.8 libxml2 man-db mime-support po-debconf
  python python-all python-dev python2.5 python2.5-dev python2.5-minimal
  python2.6 python2.6-dev readline-common
Suggested packages:
  wamerican wordlist whois vacation dh-make cvs gettext-doc groff adns-tools
  less www-browser libmail-box-perl python-doc python-tk python-profiler
  python2.5-doc binfmt-support python2.6-doc python2.6-profiler
Recommended packages:
  curl wget lynx libglib2.0-data shared-mime-info libgpm2 xml-core
  libmail-sendmail-perl libcompress-zlib-perl
The following NEW packages will be installed:
  bsdmainutils debhelper file gettext gettext-base groff-base html2text
  intltool-debian libadns1 libadns1-dev libcroco3 libglib2.0-0 libmagic1
  libncursesw5 libpython2.6 libreadline5 libsqlite3-0 libssl0.9.8 libxml2
  man-db mime-support po-debconf python python-all python-all-dev python-dev
  python-support python2.5 python2.5-dev python2.5-minimal python2.6
  python2.6-dev readline-common
0 upgraded, 33 newly installed, 0 to remove and 0 not upgraded.
Need to get 143kB/25.1MB of archives.
After this operation, 81.4MB of additional disk space will be used.
WARNING: The following packages cannot be authenticated!
  libmagic1 file libncursesw5 readline-common libreadline5 libsqlite3-0
  libssl0.9.8 mime-support python2.6 python bsdmainutils gettext-base
  groff-base libxml2 man-db python-support html2text libglib2.0-0 libcroco3
  gettext intltool-debian po-debconf debhelper libadns1 libadns1-dev
  libpython2.6 python2.5-minimal python2.5 python-all python2.6-dev python-dev
  python2.5-dev python-all-dev
Authentication warning overridden.
Get:1 http://ftpmaster.internal jaunty/main libadns1 1.4-2 [62.1kB]
Get:2 http://ftpmaster.internal jaunty/main libadns1-dev 1.4-2 [81.2kB]
debconf: unable to initialize frontend: Dialog
debconf: (Dialog frontend will not work on a dumb terminal, an emacs shell buffer, or without a controlling terminal.)
debconf: falling back to frontend: Readline
debconf: unable to initialize frontend: Readline
debconf: (This frontend requires a controlling tty.)
debconf: falling back to frontend: Teletype
dpkg-preconfigure: unable to re-open stdin: 
Fetched 143kB in 0s (3835kB/s)
Selecting previously deselected package libmagic1.
(Reading database ... 9812 files and directories currently installed.)
Unpacking libmagic1 (from .../libmagic1_4.26-2ubuntu3_amd64.deb) ...
Selecting previously deselected package file.
Unpacking file (from .../file_4.26-2ubuntu3_amd64.deb) ...
Selecting previously deselected package libncursesw5.
Unpacking libncursesw5 (from .../libncursesw5_5.7+20090207-1ubuntu1_amd64.deb) ...
Selecting previously deselected package readline-common.
Unpacking readline-common (from .../readline-common_5.2-4_all.deb) ...
Selecting previously deselected package libreadline5.
Unpacking libreadline5 (from .../libreadline5_5.2-4_amd64.deb) ...
Selecting previously deselected package libsqlite3-0.
Unpacking libsqlite3-0 (from .../libsqlite3-0_3.6.10-1_amd64.deb) ...
Selecting previously deselected package libssl0.9.8.
Unpacking libssl0.9.8 (from .../libssl0.9.8_0.9.8g-15ubuntu3_amd64.deb) ...
Selecting previously deselected package mime-support.
Unpacking mime-support (from .../mime-support_3.44-1_all.deb) ...
Selecting previously deselected package python2.6.
Unpacking python2.6 (from .../python2.6_2.6.2~rc1-0ubuntu1_amd64.deb) ...
Selecting previously deselected package python.
Unpacking python (from .../python_2.6.1-0ubuntu9_all.deb) ...
Selecting previously deselected package bsdmainutils.
Unpacking bsdmainutils (from .../bsdmainutils_6.1.10ubuntu3_amd64.deb) ...
Selecting previously deselected package gettext-base.
Unpacking gettext-base (from .../gettext-base_0.17-6ubuntu2_amd64.deb) ...
Selecting previously deselected package groff-base.
Unpacking groff-base (from .../groff-base_1.18.1.1-22build1_amd64.deb) ...
Selecting previously deselected package libxml2.
Unpacking libxml2 (from .../libxml2_2.6.32.dfsg-5ubuntu4_amd64.deb) ...
Selecting previously deselected package man-db.
Unpacking man-db (from .../man-db_2.5.5-1build1_amd64.deb) ...
Selecting previously deselected package python-support.
Unpacking python-support (from .../python-support_0.8.7ubuntu3_all.deb) ...
Selecting previously deselected package html2text.
Unpacking html2text (from .../html2text_1.3.2a-5_amd64.deb) ...
Selecting previously deselected package libglib2.0-0.
Unpacking libglib2.0-0 (from .../libglib2.0-0_2.20.0-1build2_amd64.deb) ...
Selecting previously deselected package libcroco3.
Unpacking libcroco3 (from .../libcroco3_0.6.1-2_amd64.deb) ...
Selecting previously deselected package gettext.
Unpacking gettext (from .../gettext_0.17-6ubuntu2_amd64.deb) ...
Selecting previously deselected package intltool-debian.
Unpacking intltool-debian (from .../intltool-debian_0.35.0+20060710.1_all.deb) ...
Selecting previously deselected package po-debconf.
Unpacking po-debconf (from .../po-debconf_1.0.15ubuntu1_all.deb) ...
Selecting previously deselected package debhelper.
Unpacking debhelper (from .../debhelper_7.0.17ubuntu4_all.deb) ...
Selecting previously deselected package libadns1.
Unpacking libadns1 (from .../libadns1_1.4-2_amd64.deb) ...
Selecting previously deselected package libadns1-dev.
Unpacking libadns1-dev (from .../libadns1-dev_1.4-2_amd64.deb) ...
Selecting previously deselected package libpython2.6.
Unpacking libpython2.6 (from .../libpython2.6_2.6.2~rc1-0ubuntu1_amd64.deb) ...
Selecting previously deselected package python2.5-minimal.
Unpacking python2.5-minimal (from .../python2.5-minimal_2.5.4-1ubuntu4_amd64.deb) ...
Selecting previously deselected package python2.5.
Unpacking python2.5 (from .../python2.5_2.5.4-1ubuntu4_amd64.deb) ...
Selecting previously deselected package python-all.
Unpacking python-all (from .../python-all_2.6.1-0ubuntu9_all.deb) ...
Selecting previously deselected package python2.6-dev.
Unpacking python2.6-dev (from .../python2.6-dev_2.6.2~rc1-0ubuntu1_amd64.deb) ...
Selecting previously deselected package python-dev.
Unpacking python-dev (from .../python-dev_2.6.1-0ubuntu9_all.deb) ...
Selecting previously deselected package python2.5-dev.
Unpacking python2.5-dev (from .../python2.5-dev_2.5.4-1ubuntu4_amd64.deb) ...
Selecting previously deselected package python-all-dev.
Unpacking python-all-dev (from .../python-all-dev_2.6.1-0ubuntu9_all.deb) ...
Setting up libmagic1 (4.26-2ubuntu3) ...

Setting up file (4.26-2ubuntu3) ...
Setting up libncursesw5 (5.7+20090207-1ubuntu1) ...

Setting up readline-common (5.2-4) ...

Setting up libreadline5 (5.2-4) ...

Setting up libsqlite3-0 (3.6.10-1) ...

Setting up libssl0.9.8 (0.9.8g-15ubuntu3) ...

Setting up mime-support (3.44-1) ...

Setting up python2.6 (2.6.2~rc1-0ubuntu1) ...

Setting up python (2.6.1-0ubuntu9) ...

Setting up bsdmainutils (6.1.10ubuntu3) ...

Setting up gettext-base (0.17-6ubuntu2) ...

Setting up groff-base (1.18.1.1-22build1) ...

Setting up libxml2 (2.6.32.dfsg-5ubuntu4) ...

Setting up man-db (2.5.5-1build1) ...
Building database of manual pages ...
... skipping, since this is a buildd

Setting up python-support (0.8.7ubuntu3) ...

Setting up html2text (1.3.2a-5) ...

Setting up libglib2.0-0 (2.20.0-1build2) ...

Setting up libcroco3 (0.6.1-2) ...

Setting up gettext (0.17-6ubuntu2) ...

Setting up intltool-debian (0.35.0+20060710.1) ...
Setting up po-debconf (1.0.15ubuntu1) ...

Setting up debhelper (7.0.17ubuntu4) ...

Setting up libadns1 (1.4-2) ...

Setting up libadns1-dev (1.4-2) ...
Setting up libpython2.6 (2.6.2~rc1-0ubuntu1) ...

Setting up python2.5-minimal (2.5.4-1ubuntu4) ...
Linking and byte-compiling packages for runtime python2.5...

Setting up python2.5 (2.5.4-1ubuntu4) ...

Setting up python-all (2.6.1-0ubuntu9) ...
Setting up python2.6-dev (2.6.2~rc1-0ubuntu1) ...
Setting up python-dev (2.6.1-0ubuntu9) ...
Setting up python2.5-dev (2.5.4-1ubuntu4) ...
Setting up python-all-dev (2.6.1-0ubuntu9) ...
Processing triggers for libc6 ...
ldconfig deferred processing now taking place
Checking correctness of source dependencies...
Toolchain package versions: libc6-dev_2.9-4ubuntu6 make_3.81-5 dpkg-dev_1.14.24ubuntu1 linux-libc-dev_2.6.28-11.41 g++-4.3_4.3.3-5ubuntu4 gcc-4.3_4.3.3-5ubuntu4 binutils_2.19.1-0ubuntu3 libstdc++6_4.3.3-5ubuntu4 libstdc++6-4.3-dev_4.3.3-5ubuntu4
------------------------------------------------------------------------------
sh: gcc: not found
dpkg-source: warning: Couldn't determine gcc system type, falling back to default (native compilation)
gpg: Signature made Mon Feb 23 15:57:45 2009 GMT using DSA key ID 0F932C9C
gpg: Can't check signature: public key not found
dpkg-source: extracting python-adns in python-adns-1.1.1
dpkg-source: unpacking python-adns_1.1.1.orig.tar.gz
dpkg-source: applying /home/buildd/build-jaunty-autotest/python-adns_1.1.1-0ubuntu2.diff.gz
dpkg-buildpackage: set CFLAGS to default value: -g -O2
dpkg-buildpackage: set CPPFLAGS to default value: 
dpkg-buildpackage: set LDFLAGS to default value: -Wl,-Bsymbolic-functions
dpkg-buildpackage: set FFLAGS to default value: -g -O2
dpkg-buildpackage: set CXXFLAGS to default value: -g -O2
dpkg-buildpackage: source package python-adns
dpkg-buildpackage: source version 1.1.1-0ubuntu2
dpkg-buildpackage: host architecture amd64
 /usr/bin/fakeroot debian/rules clean
pyversions: missing XS-Python-Version in control file, fall back to debian/pyversions
pyversions: missing debian/pyversions file, fall back to supported versions
dh_testdir
dh_testroot
set -e; \
	for python in python2.5 python2.6; do \
		$python setup.py clean; \
	done
running clean
running clean
rm -fr build build-stamp *.pyc
dh_clean
 debian/rules build
pyversions: missing XS-Python-Version in control file, fall back to debian/pyversions
pyversions: missing debian/pyversions file, fall back to supported versions
dh_testdir
set -e; \
	for python in python2.5 python2.6; do \
		$python setup.py build; \
	done
running build
running build_py
creating build
creating build/lib.linux-x86_64-2.5
copying DNSBL.py -> build/lib.linux-x86_64-2.5
copying ADNS.py -> build/lib.linux-x86_64-2.5
running build_ext
building 'adns' extension
creating build/temp.linux-x86_64-2.5
gcc -pthread -fno-strict-aliasing -DNDEBUG -g -fwrapv -O2 -Wall -Wstrict-prototypes -g -O2 -fPIC -I/usr/include/python2.5 -c adnsmodule.c -o build/temp.linux-x86_64-2.5/adnsmodule.o
gcc -pthread -shared -Wl,-O1 -Wl,-Bsymbolic-functions -Wl,-Bsymbolic-functions -g -O2 build/temp.linux-x86_64-2.5/adnsmodule.o -ladns -o build/lib.linux-x86_64-2.5/adns.so
running build
running build_py
creating build/lib.linux-x86_64-2.6
copying DNSBL.py -> build/lib.linux-x86_64-2.6
copying ADNS.py -> build/lib.linux-x86_64-2.6
running build_ext
building 'adns' extension
creating build/temp.linux-x86_64-2.6
gcc -pthread -fno-strict-aliasing -DNDEBUG -g -fwrapv -O2 -Wall -Wstrict-prototypes -g -O2 -fPIC -I/usr/include/python2.6 -c adnsmodule.c -o build/temp.linux-x86_64-2.6/adnsmodule.o
gcc -pthread -shared -Wl,-O1 -Wl,-Bsymbolic-functions -Wl,-Bsymbolic-functions -g -O2 build/temp.linux-x86_64-2.6/adnsmodule.o -ladns -o build/lib.linux-x86_64-2.6/adns.so
touch build-stamp
 /usr/bin/fakeroot debian/rules binary-arch
pyversions: missing XS-Python-Version in control file, fall back to debian/pyversions
pyversions: missing debian/pyversions file, fall back to supported versions
dh_testdir
dh_testroot
dh_clean -k
# Add here commands to install the package into debian/tmp
set -e; \
	for python in python2.5 python2.6; do \
		$python setup.py install --root=debian/python-adns --install-layout=deb; \
	done
running install
running build
running build_py
running build_ext
running install_lib
creating debian/python-adns
creating debian/python-adns/usr
creating debian/python-adns/usr/lib
creating debian/python-adns/usr/lib/python2.5
creating debian/python-adns/usr/lib/python2.5/site-packages
copying build/lib.linux-x86_64-2.5/DNSBL.py -> debian/python-adns/usr/lib/python2.5/site-packages
copying build/lib.linux-x86_64-2.5/ADNS.py -> debian/python-adns/usr/lib/python2.5/site-packages
copying build/lib.linux-x86_64-2.5/adns.so -> debian/python-adns/usr/lib/python2.5/site-packages
byte-compiling debian/python-adns/usr/lib/python2.5/site-packages/DNSBL.py to DNSBL.pyc
byte-compiling debian/python-adns/usr/lib/python2.5/site-packages/ADNS.py to ADNS.pyc
running install_egg_info
Writing debian/python-adns/usr/lib/python2.5/site-packages/adns_python-1.1.1.egg-info
running install
running build
running build_py
running build_ext
running install_lib
creating debian/python-adns/usr/lib/python2.6
creating debian/python-adns/usr/lib/python2.6/dist-packages
copying build/lib.linux-x86_64-2.6/DNSBL.py -> debian/python-adns/usr/lib/python2.6/dist-packages
copying build/lib.linux-x86_64-2.6/ADNS.py -> debian/python-adns/usr/lib/python2.6/dist-packages
copying build/lib.linux-x86_64-2.6/adns.so -> debian/python-adns/usr/lib/python2.6/dist-packages
byte-compiling debian/python-adns/usr/lib/python2.6/dist-packages/DNSBL.py to DNSBL.pyc
byte-compiling debian/python-adns/usr/lib/python2.6/dist-packages/ADNS.py to ADNS.pyc
running install_egg_info
Writing debian/python-adns/usr/lib/python2.6/dist-packages/adns_python-1.1.1.egg-info
dh_testdir -a
dh_testroot -a
dh_installdocs -a README
dh_installmenu -a
dh_installchangelogs -a
dh_link -a
dh_strip -a
dh_strip debug symbol extraction: disabling for archive rebuild test
dh_strip debug symbol extraction: not doing anything since NO_PKG_MANGLE is given
dh_compress -a
dh_fixperms -a
dh_makeshlibs -a
dh_pysupport -a
Traceback (most recent call last):
  File "/usr/bin/pysupport-movemodules", line 137, in <module>
    do_move (basedir, package, "usr/lib", "site-packages")
  File "/usr/bin/pysupport-movemodules", line 78, in do_move
    file_dict.addsum(relfile,pyvers,md5.new(file(absfile).read()).digest())
AttributeError: 'builtin_function_or_method' object has no attribute 'new'
dh_pysupport: command returned error code 256
make: *** [binary-arch] Error 1
dpkg-buildpackage: failure: /usr/bin/fakeroot debian/rules binary-arch gave error exit status 2
******************************************************************************
Build finished at 20090410-0646
FAILED [dpkg-buildpackage died]
Purging chroot-jaunty-autotest/build/buildd/python-adns-1.1.1
------------------------------------------------------------------------------
  /usr/bin/sudo dpkg --root=/home/buildd/build-jaunty-autotest/chroot-jaunty-autotest --purge libadns1 groff-base libadns1-dev libglib2.0-0 mime-support readline-common gettext file python2.5 python2.5-minimal po-debconf python2.6 libcroco3 python-support libxml2 libpython2.6 python-all-dev python-all python-dev man-db libssl0.9.8 intltool-debian html2text gettext-base debhelper python2.6-dev python libreadline5 libmagic1 libsqlite3-0 bsdmainutils python2.5-dev libncursesw5
(Reading database ... 12709 files and directories currently installed.)
Removing libadns1-dev ...
Removing python-support ...
Purging configuration files for python-support ...
Removing python-all-dev ...
Removing python-all ...
Removing python-dev ...
Removing debhelper ...
Removing python2.6-dev ...
Removing python ...
Purging configuration files for python ...
Removing python2.5-dev ...
Removing libadns1 ...
Purging configuration files for libadns1 ...
Removing file ...
Purging configuration files for file ...
Removing python2.5 ...
Purging configuration files for python2.5 ...
Removing python2.5-minimal ...
Unlinking and removing bytecode for runtime python2.5
Purging configuration files for python2.5-minimal ...
Removing po-debconf ...
Removing libpython2.6 ...
Purging configuration files for libpython2.6 ...
Removing man-db ...
Purging configuration files for man-db ...
  Removing catpages as well as /var/cache/man hierarchy.
dpkg - warning: while removing man-db, directory `/usr/share/doc/man-db/examples' not empty so not removed.
dpkg - warning: while removing man-db, directory `/usr/share/doc/man-db' not empty so not removed.
dpkg - warning: while removing man-db, directory `/usr/share/man-db' not empty so not removed.
dpkg - warning: while removing man-db, directory `/usr/share/bug/man-db' not empty so not removed.
dpkg - warning: while removing man-db, directory `/usr/lib/man-db' not empty so not removed.
Removing intltool-debian ...
Removing html2text ...
Purging configuration files for html2text ...
Removing libmagic1 ...
Purging configuration files for libmagic1 ...
Removing bsdmainutils ...
Purging configuration files for bsdmainutils ...
Removing groff-base ...
Purging configuration files for groff-base ...
Removing gettext ...
Removing python2.6 ...
Purging configuration files for python2.6 ...
dpkg - warning: while removing python2.6, directory `/usr/share/applications' not empty so not removed.
Removing libcroco3 ...
Purging configuration files for libcroco3 ...
Removing libxml2 ...
Purging configuration files for libxml2 ...
Removing libssl0.9.8 ...
Purging configuration files for libssl0.9.8 ...
Removing gettext-base ...
Removing libreadline5 ...
Purging configuration files for libreadline5 ...
Removing libsqlite3-0 ...
Purging configuration files for libsqlite3-0 ...
Removing libncursesw5 ...
Purging configuration files for libncursesw5 ...
Removing libglib2.0-0 ...
Purging configuration files for libglib2.0-0 ...
Removing mime-support ...
Purging configuration files for mime-support ...
Removing readline-common ...
Purging configuration files for readline-common ...
Processing triggers for libc6 ...
ldconfig deferred processing now taking place
******************************************************************************
Finished at 20090410-0646
Build needed 00:00:03, 620k disk space




More information about the ubuntu-autotest mailing list