[Bug 1727072] [NEW] do-release-upgrade to 17.10 fails on Windows 10 17017
Corey Frenette
1727072 at bugs.launchpad.net
Tue Oct 24 21:30:52 UTC 2017
*** This bug is a duplicate of bug 1725333 ***
https://bugs.launchpad.net/bugs/1725333
Public bug reported:
This is easily reproducible - install Ubuntu from the store, upgrade to
17.04 (succeeds), then upgrade again to 17.10 (fails)
ProblemType: Package
DistroRelease: Ubuntu 17.10
Package: bash 4.4-2ubuntu1.1
ProcVersionSignature: Microsoft 4.4.0-43-Microsoft 4.4.35
Uname: Linux 4.4.0-43-Microsoft x86_64
ApportVersion: 2.20.4-0ubuntu4.5
Architecture: amd64
Date: Tue Oct 24 18:04:02 2017
Dmesg:
DpkgTerminalLog:
Preparing to unpack .../bash_4.4-5ubuntu1_amd64.deb ...
preinst: ../sysdeps/unix/sysv/linux/spawni.c:368: __spawnix: Assertion `ec >= 0' failed.
dpkg: error processing archive /var/cache/apt/archives/bash_4.4-5ubuntu1_amd64.deb (--unpack):
subprocess new pre-installation script was killed by signal (Aborted), core dumped
DuplicateSignature:
package:bash:4.4-2ubuntu1.1
Preparing to unpack .../bash_4.4-5ubuntu1_amd64.deb ...
preinst: ../sysdeps/unix/sysv/linux/spawni.c:368: __spawnix: Assertion `ec >= 0' failed.
dpkg: error processing archive /var/cache/apt/archives/bash_4.4-5ubuntu1_amd64.deb (--unpack):
subprocess new pre-installation script was killed by signal (Aborted), core dumped
ErrorMessage: subprocess new pre-installation script was killed by signal (Aborted), core dumped
RelatedPackageVersions:
dpkg 1.18.10ubuntu2
apt 1.4.6~17.04.1
SourcePackage: bash
Title: package bash 4.4-2ubuntu1.1 failed to install/upgrade: subprocess new pre-installation script was killed by signal (Aborted), core dumped
UpgradeStatus: Upgraded to artful on 2017-10-24 (0 days ago)
** Affects: bash (Ubuntu)
Importance: Undecided
Status: New
** Tags: amd64 apport-package artful uec-images
--
You received this bug notification because you are a member of Ubuntu
Foundations Bugs, which is subscribed to bash in Ubuntu.
https://bugs.launchpad.net/bugs/1727072
Title:
do-release-upgrade to 17.10 fails on Windows 10 17017
Status in bash package in Ubuntu:
New
Bug description:
This is easily reproducible - install Ubuntu from the store, upgrade
to 17.04 (succeeds), then upgrade again to 17.10 (fails)
ProblemType: Package
DistroRelease: Ubuntu 17.10
Package: bash 4.4-2ubuntu1.1
ProcVersionSignature: Microsoft 4.4.0-43-Microsoft 4.4.35
Uname: Linux 4.4.0-43-Microsoft x86_64
ApportVersion: 2.20.4-0ubuntu4.5
Architecture: amd64
Date: Tue Oct 24 18:04:02 2017
Dmesg:
DpkgTerminalLog:
Preparing to unpack .../bash_4.4-5ubuntu1_amd64.deb ...
preinst: ../sysdeps/unix/sysv/linux/spawni.c:368: __spawnix: Assertion `ec >= 0' failed.
dpkg: error processing archive /var/cache/apt/archives/bash_4.4-5ubuntu1_amd64.deb (--unpack):
subprocess new pre-installation script was killed by signal (Aborted), core dumped
DuplicateSignature:
package:bash:4.4-2ubuntu1.1
Preparing to unpack .../bash_4.4-5ubuntu1_amd64.deb ...
preinst: ../sysdeps/unix/sysv/linux/spawni.c:368: __spawnix: Assertion `ec >= 0' failed.
dpkg: error processing archive /var/cache/apt/archives/bash_4.4-5ubuntu1_amd64.deb (--unpack):
subprocess new pre-installation script was killed by signal (Aborted), core dumped
ErrorMessage: subprocess new pre-installation script was killed by signal (Aborted), core dumped
RelatedPackageVersions:
dpkg 1.18.10ubuntu2
apt 1.4.6~17.04.1
SourcePackage: bash
Title: package bash 4.4-2ubuntu1.1 failed to install/upgrade: subprocess new pre-installation script was killed by signal (Aborted), core dumped
UpgradeStatus: Upgraded to artful on 2017-10-24 (0 days ago)
To manage notifications about this bug go to:
https://bugs.launchpad.net/ubuntu/+source/bash/+bug/1727072/+subscriptions
More information about the foundations-bugs
mailing list