[Bug 584347] Re: package ureadahead 0.100.0-4.1 failed to install/upgrade: error escribiendo en «<salida estándar>»: Error de entrada/salida

Mörgæs cyberpenguin1979 at gmail.com
Thu Dec 6 19:35:34 UTC 2012


Closing due to age and lack of activity.

If the problem persists in the latest Ubuntu release please open a new
bug report.


** Changed in: ureadahead (Ubuntu)
       Status: New => Invalid

-- 
You received this bug notification because you are a member of Ubuntu
Foundations Bugs, which is subscribed to ureadahead in Ubuntu.
https://bugs.launchpad.net/bugs/584347

Title:
  package ureadahead 0.100.0-4.1 failed to install/upgrade: error
  escribiendo en «<salida estándar>»: Error de entrada/salida

Status in “ureadahead” package in Ubuntu:
  Invalid

Bug description:
  Binary package hint: ureadahead

  dont konw

  ProblemType: Package
  DistroRelease: Ubuntu 10.04
  Package: ureadahead 0.100.0-4.1
  ProcVersionSignature: Ubuntu 2.6.32-22.33-generic 2.6.32.11+drm33.2
  Uname: Linux 2.6.32-22-generic i686
  Architecture: i386
  Date: Wed May 19 01:55:21 2010
  ErrorMessage: error escribiendo en «<salida estándar>»: Error de entrada/salida
  SourcePackage: ureadahead
  Title: package ureadahead 0.100.0-4.1 failed to install/upgrade: error escribiendo en «<salida estándar>»: Error de entrada/salida

To manage notifications about this bug go to:
https://bugs.launchpad.net/ubuntu/+source/ureadahead/+bug/584347/+subscriptions




More information about the foundations-bugs mailing list