problem !

Lucian Goron luciangoron at
Mon May 17 10:25:46 UTC 2010

I installed libann-dev and it automatically installed libann0 also.
But when I tried to build it again it gave the same error

lucian at schwarz:~/work/ransac$ make
Linking CXX executable coloredElevationMap
/usr/bin/ld: cannot find -lANN
collect2: ld returned 1 exit status
make[2]: *** [coloredElevationMap] Error 1
make[1]: *** [CMakeFiles/coloredElevationMap.dir/all] Error 2
make: *** [all] Error 2

Can somebody help me ?

MSc., Eng. Lucian GORON, PhD. Student
Robotic Research Group, Technical University of Cluj-Napoca
71-73 Dorobantilor Street, Room C24, 400609 Cluj-Napoca, Romania
0040 264 401267 (office), 0040 727 361624 (mobile)
lucian.goron at
-------------- next part --------------
An HTML attachment was scrubbed...
URL: <>

More information about the ubuntu-users mailing list