Build failed in Jenkins: precise-server-i386_lamp-reboot #700

Jenkins Notification devnull at canonical.com
Tue Jun 10 10:11:19 UTC 2014


See <http://d-jenkins.ubuntu-ci:8080/job/precise-server-i386_lamp-reboot/700/>

------------------------------------------
[...truncated 141 lines...]
DEBUG:root:running
DEBUG:root:Capturing current d-i syslog for test case 630d7fca-628b-471b-aa69-f3e2d952ea20
DEBUG:root:Jun 10 10:05:37 in-target: debconf (developer): --> 0 OK
Jun 10 10:05:38 in-target: Running depmod.
Jun 10 10:05:41 in-target: update-initramfs: deferring update (hook will be called later)
Jun 10 10:05:41 in-target: Examining /etc/kernel/postinst.d.
Jun 10 10:05:41 in-target: run-parts: executing /etc/kernel/postinst.d/apt-auto-removal
Jun 10 10:05:41 in-target:  3.11.0-23-generic
Jun 10 10:05:41 in-target:  /boot/vmlinuz-3.11.0-23-generic
Jun 10 10:05:41 in-target: 
Jun 10 10:05:41 in-target: run-parts: executing /etc/kernel/postinst.d/initramfs-tools 3.11.0-23-generic /boot/vmlinuz-3.11.0-23-generic
Jun 10 10:05:41 in-target: update-initramfs: Generating /boot/initrd.img-3.11.0-23-generic
DEBUG:root:Checking VM state for test case 630d7fca-628b-471b-aa69-f3e2d952ea20
DEBUG:root:Cmd: ['virsh', 'domstate', '630d7fca-628b-471b-aa69-f3e2d952ea20']
DEBUG:root:running
DEBUG:root:Capturing current d-i syslog for test case 630d7fca-628b-471b-aa69-f3e2d952ea20
DEBUG:root:Jun 10 10:06:16 debconf: <-- 0 OK
Jun 10 10:06:16 in-target: debconf (developer): <---- 0 OK
Jun 10 10:06:16 in-target: debconf (developer): --> 0 OK
Jun 10 10:06:16 in-target: debconf (developer): <-- PROGRESS SET 800
Jun 10 10:06:16 in-target: debconf (developer): ----> PROGRESS SET 800
Jun 10 10:06:16 debconf: --> PROGRESS SET 800
Jun 10 10:06:16 debconf: <-- 0 OK
Jun 10 10:06:16 in-target: debconf (developer): <---- 0 OK
Jun 10 10:06:16 in-target: debconf (developer): --> 0 OK
Jun 10 10:06:16 in-target: debconf (developer): <-- SUBST debconf-apt-progress/info DESCRIPTION Retrieving file 40 of 54
DEBUG:root:Checking VM state for test case 630d7fca-628b-471b-aa69-f3e2d952ea20
DEBUG:root:Cmd: ['virsh', 'domstate', '630d7fca-628b-471b-aa69-f3e2d952ea20']
DEBUG:root:running
DEBUG:root:Capturing current d-i syslog for test case 630d7fca-628b-471b-aa69-f3e2d952ea20
DEBUG:root:Jun 10 10:06:46 in-target: libmount1 is already the newest version.
Jun 10 10:06:46 in-target: libuuid1 is already the newest version.
Jun 10 10:06:46 in-target: mount is already the newest version.
Jun 10 10:06:46 in-target: util-linux is already the newest version.
Jun 10 10:06:46 in-target: vim-common is already the newest version.
Jun 10 10:06:46 in-target: vim-tiny is already the newest version.
Jun 10 10:06:46 in-target: xkb-data is already the newest version.
Jun 10 10:06:46 in-target: liblzma5 is already the newest version.
Jun 10 10:06:46 in-target: xz-lzma is already the newest version.
Jun 10 10:06:46 in-target: xz-lzma set to manually installed.
DEBUG:root:Checking VM state for test case 630d7fca-628b-471b-aa69-f3e2d952ea20
DEBUG:root:Cmd: ['virsh', 'domstate', '630d7fca-628b-471b-aa69-f3e2d952ea20']
DEBUG:root:running
DEBUG:root:Capturing current d-i syslog for test case 630d7fca-628b-471b-aa69-f3e2d952ea20
DEBUG:root:Jun 10 10:07:06 debconf: <-- 0 OK
Jun 10 10:07:06 in-target: debconf (developer): <---- 0 OK
Jun 10 10:07:06 in-target: debconf (developer): --> 0 OK
Jun 10 10:07:06 in-target: debconf (developer): <-- SUBST debconf-apt-progress/info DESCRIPTION Installed install-info
Jun 10 10:07:06 in-target: debconf (developer): --> 0
Jun 10 10:07:06 in-target: debconf (developer): <-- PROGRESS INFO debconf-apt-progress/info
Jun 10 10:07:06 in-target: debconf (developer): ----> DATA debconf-apt-progress/info type text
Jun 10 10:07:06 debconf: --> DATA debconf-apt-progress/info type text
Jun 10 10:07:06 debconf: <-- 0 OK
Jun 10 10:0
DEBUG:root:Checking VM state for test case 630d7fca-628b-471b-aa69-f3e2d952ea20
DEBUG:root:Cmd: ['virsh', 'domstate', '630d7fca-628b-471b-aa69-f3e2d952ea20']
DEBUG:root:running
DEBUG:root:Capturing current d-i syslog for test case 630d7fca-628b-471b-aa69-f3e2d952ea20
DEBUG:root:Jun 10 10:07:45 in-target: debconf (developer): <-- SUBST debconf-apt-progress/info DESCRIPTION Configuring libpcsclite1
Jun 10 10:07:45 in-target: debconf (developer): --> 0
Jun 10 10:07:45 in-target: debconf (developer): <-- PROGRESS INFO debconf-apt-progress/info
Jun 10 10:07:45 in-target: debconf (developer): ----> DATA debconf-apt-progress/info type text
Jun 10 10:07:45 debconf: --> DATA debconf-apt-progress/info type text
Jun 10 10:07:45 debconf: <-- 0 OK
Jun 10 10:07:45 in-target: debconf (developer): <---- 0 OK
Jun 10 10:07:45 in-target: debconf (developer): ----> DATA debconf-apt-progress/info description Configuring libpcsclite1
Jun 10 10:07:45 debconf: --> DATA debconf-apt-progress/info description Configuring libpcsclite1
Jun 10 10:07:45 debconf: <-- 0 OK
DEBUG:root:Checking VM state for test case 630d7fca-628b-471b-aa69-f3e2d952ea20
DEBUG:root:Cmd: ['virsh', 'domstate', '630d7fca-628b-471b-aa69-f3e2d952ea20']
DEBUG:root:running
DEBUG:root:Capturing current d-i syslog for test case 630d7fca-628b-471b-aa69-f3e2d952ea20
DEBUG:root:Jun 10 10:08:14 in-target: debconf (developer): ----> DATA debconf-apt-progress/info type text
Jun 10 10:08:14 debconf: --> DATA debconf-apt-progress/info type text
Jun 10 10:08:14 debconf: <-- 0 OK
Jun 10 10:08:14 in-target: debconf (developer): <---- 0 OK
Jun 10 10:08:14 in-target: debconf (developer): ----> DATA debconf-apt-progress/info description Retrieving file 27 of 55
Jun 10 10:08:14 debconf: --> DATA debconf-apt-progress/info description Retrieving file 27 of 55
Jun 10 10:08:14 debconf: <-- 0 OK
Jun 10 10:08:14 in-target: debconf (developer): <---- 0 OK
Jun 10 10:08:14 in-target: debconf (developer): ----> PROGRESS INFO debconf-apt-progress/info
Jun 10 10:08:14 debconf: --> PROGRESS INFO debconf-apt-progress/
DEBUG:root:Checking VM state for test case 630d7fca-628b-471b-aa69-f3e2d952ea20
DEBUG:root:Cmd: ['virsh', 'domstate', '630d7fca-628b-471b-aa69-f3e2d952ea20']
DEBUG:root:running
DEBUG:root:Capturing current d-i syslog for test case 630d7fca-628b-471b-aa69-f3e2d952ea20
DEBUG:root:Jun 10 10:08:42 in-target: done
Jun 10 10:08:42 in-target:   en_AU.UTF-8... 
Jun 10 10:08:43 in-target: done
Jun 10 10:08:43 in-target:   en_BW.UTF-8... 
Jun 10 10:08:44 in-target: done
Jun 10 10:08:44 in-target:   en_CA.UTF-8... 
Jun 10 10:08:45 in-target: done
Jun 10 10:08:45 in-target:   en_DK.UTF-8... 
Jun 10 10:08:46 in-target: done
Jun 10 10:08:46 in-target:   en_GB.UTF-8...
DEBUG:root:Checking VM state for test case 630d7fca-628b-471b-aa69-f3e2d952ea20
DEBUG:root:Cmd: ['virsh', 'domstate', '630d7fca-628b-471b-aa69-f3e2d952ea20']
DEBUG:root:running
DEBUG:root:Capturing current d-i syslog for test case 630d7fca-628b-471b-aa69-f3e2d952ea20
DEBUG:root:Jun 10 10:09:17 debconf: --> PROGRESS INFO debconf-apt-progress/info
Jun 10 10:09:17 debconf: <-- 0 OK
Jun 10 10:09:17 in-target: debconf (developer): <---- 0 OK
Jun 10 10:09:17 in-target: debconf (developer): --> 0 OK
Jun 10 10:09:17 in-target: runlevel:/var/run/utmp: No such file or directory
Jun 10 10:09:17 in-target: invoke-rc.d: policy-rc.d denied execution of start.
Jun 10 10:09:17 in-target: debconf (developer): <-- SUBST debconf-apt-progress/info DESCRIPTION Installed grub-common
Jun 10 10:09:17 in-target: debconf (developer): --> 0
Jun 10 10:09:17 in-target: debconf (developer): <-- PROGRESS INFO debconf-apt-progress/info
Jun 10 10:09:17 in-target: debconf (developer): ----> DATA debconf-apt-progress/info type text
DEBUG:root:Checking VM state for test case 630d7fca-628b-471b-aa69-f3e2d952ea20
DEBUG:root:Cmd: ['virsh', 'domstate', '630d7fca-628b-471b-aa69-f3e2d952ea20']
DEBUG:root:running
DEBUG:root:Capturing current d-i syslog for test case 630d7fca-628b-471b-aa69-f3e2d952ea20
DEBUG:root:Jun 10 10:09:37 finish-install: info: Running /usr/lib/finish-install.d/90console
Jun 10 10:09:37 debconf: --> GET finish-install/keep-consoles
Jun 10 10:09:37 debconf: <-- 0 false
Jun 10 10:09:37 debconf: --> PROGRESS STEP 1
Jun 10 10:09:37 debconf: <-- 0 OK
Jun 10 10:09:37 debconf: --> PROGRESS INFO finish-install/progress/save-logs
Jun 10 10:09:37 debconf: <-- 0 OK
Jun 10 10:09:37 finish-install: info: Running /usr/lib/finish-install.d/94save-logs
Jun 10 10:09:37 debconf: --> X_SAVE
Jun 10 10:09:38 debconf: <-- 0 OK
DEBUG:root:Checking VM state for test case 630d7fca-628b-471b-aa69-f3e2d952ea20
DEBUG:root:Cmd: ['virsh', 'domstate', '630d7fca-628b-471b-aa69-f3e2d952ea20']
DEBUG:root:running
DEBUG:root:Capturing current d-i syslog for test case 630d7fca-628b-471b-aa69-f3e2d952ea20
DEBUG:root:Jun 10 10:09:37 finish-install: info: Running /usr/lib/finish-install.d/90console
Jun 10 10:09:37 debconf: --> GET finish-install/keep-consoles
Jun 10 10:09:37 debconf: <-- 0 false
Jun 10 10:09:37 debconf: --> PROGRESS STEP 1
Jun 10 10:09:37 debconf: <-- 0 OK
Jun 10 10:09:37 debconf: --> PROGRESS INFO finish-install/progress/save-logs
Jun 10 10:09:37 debconf: <-- 0 OK
Jun 10 10:09:37 finish-install: info: Running /usr/lib/finish-install.d/94save-logs
Jun 10 10:09:37 debconf: --> X_SAVE
Jun 10 10:09:38 debconf: <-- 0 OK
DEBUG:root:Checking VM state for test case 630d7fca-628b-471b-aa69-f3e2d952ea20
DEBUG:root:Cmd: ['virsh', 'domstate', '630d7fca-628b-471b-aa69-f3e2d952ea20']
DEBUG:root:running
DEBUG:root:Capturing current d-i syslog for test case 630d7fca-628b-471b-aa69-f3e2d952ea20
DEBUG:root:Jun 10 10:09:37 finish-install: info: Running /usr/lib/finish-install.d/90console
Jun 10 10:09:37 debconf: --> GET finish-install/keep-consoles
Jun 10 10:09:37 debconf: <-- 0 false
Jun 10 10:09:37 debconf: --> PROGRESS STEP 1
Jun 10 10:09:37 debconf: <-- 0 OK
Jun 10 10:09:37 debconf: --> PROGRESS INFO finish-install/progress/save-logs
Jun 10 10:09:37 debconf: <-- 0 OK
Jun 10 10:09:37 finish-install: info: Running /usr/lib/finish-install.d/94save-logs
Jun 10 10:09:37 debconf: --> X_SAVE
Jun 10 10:09:38 debconf: <-- 0 OK
DEBUG:root:Checking VM state for test case 630d7fca-628b-471b-aa69-f3e2d952ea20
DEBUG:root:Cmd: ['virsh', 'domstate', '630d7fca-628b-471b-aa69-f3e2d952ea20']
DEBUG:root:running
DEBUG:root:Capturing current d-i syslog for test case 630d7fca-628b-471b-aa69-f3e2d952ea20
DEBUG:root:Jun 10 10:09:37 finish-install: info: Running /usr/lib/finish-install.d/90console
Jun 10 10:09:37 debconf: --> GET finish-install/keep-consoles
Jun 10 10:09:37 debconf: <-- 0 false
Jun 10 10:09:37 debconf: --> PROGRESS STEP 1
Jun 10 10:09:37 debconf: <-- 0 OK
Jun 10 10:09:37 debconf: --> PROGRESS INFO finish-install/progress/save-logs
Jun 10 10:09:37 debconf: <-- 0 OK
Jun 10 10:09:37 finish-install: info: Running /usr/lib/finish-install.d/94save-logs
Jun 10 10:09:37 debconf: --> X_SAVE
Jun 10 10:09:38 debconf: <-- 0 OK
DEBUG:root:Checking VM state for test case 630d7fca-628b-471b-aa69-f3e2d952ea20
DEBUG:root:Cmd: ['virsh', 'domstate', '630d7fca-628b-471b-aa69-f3e2d952ea20']
DEBUG:root:shut off
DEBUG:root:VM powered off for test case 630d7fca-628b-471b-aa69-f3e2d952ea20
DEBUG:root:test[iso_url]=/var/lib/ubuntu-iso-testing/isos/ubuntu-server/precise-server-i386.iso
DEBUG:root:test[post-reboot-results]={'lamp-reboot': {'started': '2014-06-10T10:11:02.645241', 'script_stdout': '<testsuite errors="0" failures="0" name="" tests="1" time="0.046">\n<testcase classname="test.DefaultTest" name="test_recorded_state" time="0.037"/>\n</testsuite>\n', 'finished': '2014-06-10T10:11:02.932911', 'returncode': 0, 'script_stderr': u''}}
DEBUG:root:test[_rev]=22-2d67b63ef41ee798c60ac7f21d481efe
DEBUG:root:test[disks]=[{'bus': 'virtio', 'size': '2G', 'target': 'vda', 'format': 'qcow2'}]
DEBUG:root:test[results]={'lamp-reboot': {'started': '2014-06-10T10:10:20.656850', 'script_stdout': 'error: setUpClass (test.LampRebootTest) [\nTraceback (most recent call last):\n  File "test.py", line 37, in setUpClass\n    subprocess.check_call([\'tasksel\',\'install\',\'lamp-server\'],env=env)\n  File "/usr/lib/python2.7/subprocess.py", line 511, in check_call\n    raise CalledProcessError(retcode, cmd)\nCalledProcessError: Command \'[\'tasksel\', \'install\', \'lamp-server\']\' returned non-zero exit status 1\n]\n<testsuite errors="0" failures="0" name="" tests="0" time="4.410">\n</testsuite>\n', 'finished': '2014-06-10T10:10:25.362400', 'returncode': 0, 'script_stderr': 'tasksel: aptitude failed (100)\n'}}
DEBUG:root:test[_attachments]={'pxe/kernel': {'stub': True, 'length': 5967360, 'digest': 'md5-LuKuMGflUpfWt2C3uHIbEA==', 'revpos': 6, 'content_type': u''}, 'tests/lamp-reboot': {'stub': True, 'length': 3094, 'digest': 'md5-yg8o6cvz1/duHxbwe3Bmfw==', 'revpos': 8, 'content_type': u''}, 'pxe/pxelinux.cfg/52:54:00:11:39:19': {'stub': True, 'length': 1108, 'digest': 'md5-b4Pnf/LuJUwTJbzSygzstA==', 'revpos': 7, 'content_type': u''}, 'post-reboot-tests/lamp-reboot': {'stub': True, 'length': 1458, 'digest': 'md5-cWfzL+xCNII6ijRKLvoI2w==', 'revpos': 9, 'content_type': u''}, 'libvirt.xml': {'stub': True, 'length': 2031, 'digest': 'md5-vdK74G8kiOrxPbLEqBqH8g==', 'revpos': 12, 'content_type': 'application/xml'}, 'preseed': {'stub': True, 'length': 13166, 'digest': 'md5-XcZMj854AZTia/YQRafAWw==', 'revpos': 2, 'content_type': u''}, 'pxe/initrd': {'stub': True, 'length': 6643353, 'digest': 'md5-JKent5Ah/sqhyAVpe2rnLQ==', 'revpos': 5, 'content_type': u''}, 'media_info': {'stub': True, 'length': 70, 'digest': 'md5-0c4lC0b52vghj4bDRovrJA==', 'revpos': 3, 'content_type': u''}, 'run_test': {'stub': True, 'length': 6943, 'digest': 'md5-ZbbgRpEcHSeMP9A+cvAv1Q==', 'revpos': 4, 'content_type': u''}}
DEBUG:root:test[states]={'rebooted': '2014-06-10T10:10:25.453492', 'creating': '2014-06-10T10:02:39.912744', 'created': '2014-06-10T10:02:45.767773', 'started': '2014-06-10T10:02:47.128919', 'configured': '2014-06-10T10:02:46.111869', 'testing': '2014-06-10T10:11:02.597550', 'tested': '2014-06-10T10:11:02.989394'}
DEBUG:root:test[mac]=52:54:00:11:39:19
DEBUG:root:test[_id]=630d7fca-628b-471b-aa69-f3e2d952ea20
DEBUG:root:test[test_case]=lamp-reboot
DEBUG:root:Tests completed for test case 630d7fca-628b-471b-aa69-f3e2d952ea20
DEBUG:root:Storing results for test lamp-reboot
DEBUG:root:Reboot tests completed for test case 630d7fca-628b-471b-aa69-f3e2d952ea20
DEBUG:root:Storing results for test lamp-reboot
DEBUG:root:Undefine VM for  test case 630d7fca-628b-471b-aa69-f3e2d952ea20
DEBUG:root:Cmd: ['virsh', 'undefine', '630d7fca-628b-471b-aa69-f3e2d952ea20']
Domain 630d7fca-628b-471b-aa69-f3e2d952ea20 has been undefined

DEBUG:root:Collating output for test case 630d7fca-628b-471b-aa69-f3e2d952ea20
Archiving artifacts
Recording test results
ERROR: Failed to archive test reports
hudson.util.IOException2: remote file operation failed: <http://d-jenkins.ubuntu-ci:8080/job/precise-server-i386_lamp-reboot/ws/> at hudson.remoting.Channel at 4f468de8:wazn
	at hudson.FilePath.act(FilePath.java:848)
	at hudson.FilePath.act(FilePath.java:834)
	at hudson.tasks.junit.JUnitParser.parse(JUnitParser.java:87)
	at hudson.tasks.junit.JUnitResultArchiver.parse(JUnitResultArchiver.java:122)
	at hudson.tasks.junit.JUnitResultArchiver.perform(JUnitResultArchiver.java:134)
	at hudson.tasks.BuildStepMonitor$1.perform(BuildStepMonitor.java:19)
	at hudson.model.AbstractBuild$AbstractBuildExecution.perform(AbstractBuild.java:718)
	at hudson.model.AbstractBuild$AbstractBuildExecution.performAllBuildSteps(AbstractBuild.java:693)
	at hudson.model.Build$BuildExecution.post2(Build.java:183)
	at hudson.model.AbstractBuild$AbstractBuildExecution.post(AbstractBuild.java:640)
	at hudson.model.Run.execute(Run.java:1527)
	at hudson.model.FreeStyleBuild.run(FreeStyleBuild.java:46)
	at hudson.model.ResourceController.execute(ResourceController.java:88)
	at hudson.model.Executor.run(Executor.java:237)
Caused by: hudson.util.IOException2: Failed to read <http://d-jenkins.ubuntu-ci:8080/job/precise-server-i386_lamp-reboot/700/artifact/700/test-results/TEST-lamp-reboot.xml>
	at hudson.tasks.junit.TestResult.parse(TestResult.java:244)
	at hudson.tasks.junit.TestResult.parse(TestResult.java:163)
	at hudson.tasks.junit.TestResult.parse(TestResult.java:140)
	at hudson.tasks.junit.TestResult.<init>(TestResult.java:116)
	at hudson.tasks.junit.JUnitParser$ParseResultCallable.invoke(JUnitParser.java:117)
	at hudson.tasks.junit.JUnitParser$ParseResultCallable.invoke(JUnitParser.java:90)
	at hudson.FilePath$FileCallableWrapper.call(FilePath.java:2246)
	at hudson.remoting.UserRequest.perform(UserRequest.java:118)
	at hudson.remoting.UserRequest.perform(UserRequest.java:48)
	at hudson.remoting.Request$2.run(Request.java:326)
	at hudson.remoting.InterceptingExecutorService$1.call(InterceptingExecutorService.java:72)
	at java.util.concurrent.FutureTask.run(FutureTask.java:262)
	at java.util.concurrent.ThreadPoolExecutor.runWorker(ThreadPoolExecutor.java:1145)
	at java.util.concurrent.ThreadPoolExecutor$Worker.run(ThreadPoolExecutor.java:615)
	at hudson.remoting.Engine$1$1.run(Engine.java:58)
	at java.lang.Thread.run(Thread.java:744)
Caused by: org.dom4j.DocumentException: Error on line 1 of document file://<http://d-jenkins.ubuntu-ci:8080/job/precise-server-i386_lamp-reboot/700/artifact/700/test-results/TEST-lamp-reboot.xml> : Content is not allowed in prolog. Nested exception: Content is not allowed in prolog.
	at org.dom4j.io.SAXReader.read(SAXReader.java:482)
	at org.dom4j.io.SAXReader.read(SAXReader.java:264)
	at hudson.tasks.junit.SuiteResult.parse(SuiteResult.java:116)
	at hudson.tasks.junit.TestResult.parse(TestResult.java:227)
	... 15 more
Caused by: org.xml.sax.SAXParseException; systemId: file://<http://d-jenkins.ubuntu-ci:8080/job/precise-server-i386_lamp-reboot/700/artifact/700/test-results/TEST-lamp-reboot.xml;> lineNumber: 1; columnNumber: 1; Content is not allowed in prolog.
	at com.sun.org.apache.xerces.internal.util.ErrorHandlerWrapper.createSAXParseException(ErrorHandlerWrapper.java:198)
	at com.sun.org.apache.xerces.internal.util.ErrorHandlerWrapper.fatalError(ErrorHandlerWrapper.java:177)
	at com.sun.org.apache.xerces.internal.impl.XMLErrorReporter.reportError(XMLErrorReporter.java:441)
	at com.sun.org.apache.xerces.internal.impl.XMLErrorReporter.reportError(XMLErrorReporter.java:368)
	at com.sun.org.apache.xerces.internal.impl.XMLScanner.reportFatalError(XMLScanner.java:1436)
	at com.sun.org.apache.xerces.internal.impl.XMLDocumentScannerImpl$PrologDriver.next(XMLDocumentScannerImpl.java:999)
	at com.sun.org.apache.xerces.internal.impl.XMLDocumentScannerImpl.next(XMLDocumentScannerImpl.java:606)
	at com.sun.org.apache.xerces.internal.impl.XMLNSDocumentScannerImpl.next(XMLNSDocumentScannerImpl.java:117)
	at com.sun.org.apache.xerces.internal.impl.XMLDocumentFragmentScannerImpl.scanDocument(XMLDocumentFragmentScannerImpl.java:510)
	at com.sun.org.apache.xerces.internal.parsers.XML11Configuration.parse(XML11Configuration.java:848)
	at com.sun.org.apache.xerces.internal.parsers.XML11Configuration.parse(XML11Configuration.java:777)
	at com.sun.org.apache.xerces.internal.parsers.XMLParser.parse(XMLParser.java:141)
	at com.sun.org.apache.xerces.internal.parsers.AbstractSAXParser.parse(AbstractSAXParser.java:1213)
	at com.sun.org.apache.xerces.internal.jaxp.SAXParserImpl$JAXPSAXParser.parse(SAXParserImpl.java:649)
	at org.dom4j.io.SAXReader.read(SAXReader.java:465)
	... 18 more
Build step 'Publish JUnit test result report' changed build result to FAILURE
Description set: 20140610



More information about the ubuntu-testing-notifications mailing list