Build failed in Jenkins: precise-server-i386_lamp-reboot #671

Jenkins Notification devnull at canonical.com
Mon May 12 10:17:25 UTC 2014


See <http://d-jenkins.ubuntu-ci:8080/job/precise-server-i386_lamp-reboot/671/>

------------------------------------------
[...truncated 113 lines...]
DEBUG:root:running
DEBUG:root:Capturing current d-i syslog for test case 76664dbf-3937-4ae9-88b4-7c1320b3669e
DEBUG:root:May 12 10:11:51 debconf: <-- 0 multiselect backup progresscancel align plugin-terminal plugin-detect-keyboard
May 12 10:11:51 in-target: debconf (developer): <---- 0 multiselect backup progresscancel align plugin-terminal plugin-detect-keyboard
May 12 10:11:51 in-target: debconf (developer): --> 0 multiselect escape multiselect backup progresscancel align plugin-terminal plugin-detect-keyboard
May 12 10:11:51 in-target: debconf (developer): <---- 0 multiselect escape multiselect backup progresscancel align plugin-terminal plugin-detect-keyboard
May 12 10:11:51 in-target: debconf (developer): ----> CAPB
May 12 10:11:51 in-target: debconf (developer): <-- CAPB
May 12 10:11:51 in-target: debconf (developer): --> 0 multiselect escape multiselect backup progresscancel align plugin-terminal plugin-detect-keyboard
May 12 10:11:51 in-target: debconf (developer): <---- 0 multiselect escape multiselect backup progresscancel align plugin-terminal plugin-detect-keyboard
May 12 10:11:51 in-target: debconf (developer): --> 0 multiselect escape multiselect escape multiselect backup progresscancel align plugin-terminal plugin-detect-keyboard
May 12 10:11:51 in-target: Done.
DEBUG:root:Checking VM state for test case 76664dbf-3937-4ae9-88b4-7c1320b3669e
DEBUG:root:Cmd: ['virsh', 'domstate', '76664dbf-3937-4ae9-88b4-7c1320b3669e']
DEBUG:root:running
DEBUG:root:Capturing current d-i syslog for test case 76664dbf-3937-4ae9-88b4-7c1320b3669e
DEBUG:root:May 12 10:12:23 debconf: --> GET base-installer/install-recommends
May 12 10:12:23 debconf: <-- 0 true
May 12 10:12:23 debconf: --> GET mirror/protocol
May 12 10:12:23 debconf: <-- 0 http
May 12 10:12:23 debconf: --> GET mirror/http/proxy
May 12 10:12:23 debconf: <-- 0 http://192.168.123.1:3142
May 12 10:12:23 debconf: --> GET debconf/priority
May 12 10:12:23 debconf: <-- 0 critical
May 12 10:12:23 debconf: --> GET debian-installer/locale
May 12 10:12:23 debconf: <-- 0 en_US.UTF-8
DEBUG:root:Checking VM state for test case 76664dbf-3937-4ae9-88b4-7c1320b3669e
DEBUG:root:Cmd: ['virsh', 'domstate', '76664dbf-3937-4ae9-88b4-7c1320b3669e']
DEBUG:root:running
DEBUG:root:Capturing current d-i syslog for test case 76664dbf-3937-4ae9-88b4-7c1320b3669e
DEBUG:root:May 12 10:12:53 apt-setup: Using only basic sources for CD installation
May 12 10:12:53 debconf: --> GET mirror/protocol
May 12 10:12:53 debconf: <-- 0 http
May 12 10:12:53 debconf: --> GET mirror/http/proxy
May 12 10:12:53 debconf: <-- 0 http://192.168.123.1:3142
May 12 10:12:53 debconf: --> GET debconf/priority
May 12 10:12:53 debconf: <-- 0 critical
May 12 10:12:53 debconf: --> GET debian-installer/locale
May 12 10:12:53 debconf: <-- 0 en_US.UTF-8
May 12 10:12:53 in-target: Reading package lists...
DEBUG:root:Checking VM state for test case 76664dbf-3937-4ae9-88b4-7c1320b3669e
DEBUG:root:Cmd: ['virsh', 'domstate', '76664dbf-3937-4ae9-88b4-7c1320b3669e']
DEBUG:root:running
DEBUG:root:Capturing current d-i syslog for test case 76664dbf-3937-4ae9-88b4-7c1320b3669e
DEBUG:root:May 12 10:13:20 debconf: --> PROGRESS INFO debconf-apt-progress/info
May 12 10:13:20 debconf: <-- 0 OK
May 12 10:13:20 in-target: debconf (developer): <---- 0 OK
May 12 10:13:20 in-target: debconf (developer): --> 0 OK
May 12 10:13:20 in-target: debconf (developer): <-- PROGRESS SET 255
May 12 10:13:20 in-target: debconf (developer): ----> PROGRESS SET 255
May 12 10:13:20 debconf: --> PROGRESS SET 255
May 12 10:13:20 debconf: <-- 0 OK
May 12 10:13:20 in-target: debconf (developer): <---- 0 OK
May 12 10:13:20 in-target: debco
DEBUG:root:Checking VM state for test case 76664dbf-3937-4ae9-88b4-7c1320b3669e
DEBUG:root:Cmd: ['virsh', 'domstate', '76664dbf-3937-4ae9-88b4-7c1320b3669e']
DEBUG:root:running
DEBUG:root:Capturing current d-i syslog for test case 76664dbf-3937-4ae9-88b4-7c1320b3669e
DEBUG:root:May 12 10:13:51 in-target: DST_Root_CA_X3.crt, mozilla/D-TRUST_Root_Class_3_CA_2_2009.crt, mozilla/D-TRUST_Root_Class_3_CA_2_EV_2009.crt, mozilla/EBG_Elektronik_Sertifika_Hizmet_Sa��lay��c��s��.crt, mozilla/EC-ACC.crt, mozilla/EE_Certification_Centre_Root_CA.crt, mozilla/E-Guven_Kok_Elektronik_Sertifika_Hizmet_Saglayicisi.crt, mozilla/Entrust.net_Premium_2048_Secure_Server_CA.crt, mozilla/Entrust.net_Secure_Server_CA.crt, mozilla/Entrust_Root_Certification_Authority.crt, mozilla/ePKI_Root_Certification
May 12 10:13:51 in-target: lSign_Root_CA.crt, mozilla/GlobalSign_Root_CA_-_R2.crt, mozilla/GlobalSign_Root_CA_-_R3.crt, mozilla/Go_Daddy_Class_2_CA.crt, mozilla/Go_Daddy_Root_Certificate_Authority_-_G2.crt, mozilla/GTE_CyberTrust_Global_Root.crt, mozilla/Hellenic_Academic_and_Research_Institutions_RootCA_2011.crt, mozilla/Hongkong_Post_Root_CA_1.crt, mozilla/IGC_A.crt, mozilla/Izenpe.com.crt, mozilla/Juur-SK.crt, mozilla/Microsec_e-Szigno_Root_CA_2009.crt, mozilla/Microsec_e-Szigno_Root_CA.crt, mozilla
May 12 10:13:51 in-target: ity_2048_v3.crt, mozilla/Secure_Global_CA.crt, mozilla/SecureSign_RootCA11.crt, mozilla/SecureTrust_CA.crt, mozilla/Security_Communication_EV_RootCA1.crt, mozilla/Security_Communication_RootCA2.crt, mozilla/Security_Communication_Root_CA.crt, mozilla/Sonera_Class_1_Root_CA.crt, mozilla/Sonera_Class_2_Root_CA.crt, mozilla/Staat_der_Nederlanden_Root_CA.crt, mozilla/Staat_der_Nederlanden_Root_CA_-_G2.crt, mozilla/Starfield_Class_2_CA.crt, mozilla/Starfield_Root_Certificate_Autho
May 12 10:13:51 in-target: Center_Class_2_CA_II.crt, mozilla/TC_TrustCenter_Class_3_CA_II.crt, mozilla/TC_TrustCenter_Universal_CA_I.crt, mozilla/TDC_Internet_Root_CA.crt, mozilla/TDC_OCES_Root_CA.crt, mozilla/Thawte_Premium_Server_CA.crt, mozilla/thawte_Primary_Root_CA.crt, mozilla/thawte_Primary_Root_CA_-_G2.crt, mozilla/thawte_Primary_Root_CA_-_G3.crt, mozilla/Thawte_Server_CA.crt, mozilla/Trustis_FPS_Root_CA.crt, mozilla/T-TeleSec_GlobalRoot_Class_3.crt, mozilla/T��B��TAK_UEKAE_K��k_Sertifika_Hizme
May 12 10:13:51 in-target: ss_1_Public_Primary_Certification_Authority_-_G2.crt, mozilla/Verisign_Class_1_Public_Primary_Certification_Authority_-_G3.crt, mozilla/Verisign_Class_2_Public_Primary_Certification_Authority_-_G2.crt, mozilla/Verisign_Class_2_Public_Primary_Certification_Authority_-_G3.crt, mozilla/Verisign_Class_3_Public_Primary_Certification_Authority_2.crt, mozilla/Verisign_Class_3_Public_Primary_Certification_Authority.crt, mozilla/Verisign_Class_3_Public_Primary_Certification_Authority_
May 12 10:13:51 in-target: acert-2008.crt
May 12 10:13:51 in-target: debconf (developer): <-- FSET ca-certificates/new_crts seen false
May 12 10:13:51 in-target: debconf (developer): --> 0 false
May 12 10:13:51 in-target: debconf (developer): <-- STOP
May 12 10:13:51 in-target: Updating certificates in /etc/ssl/certs...
DEBUG:root:Checking VM state for test case 76664dbf-3937-4ae9-88b4-7c1320b3669e
DEBUG:root:Cmd: ['virsh', 'domstate', '76664dbf-3937-4ae9-88b4-7c1320b3669e']
DEBUG:root:running
DEBUG:root:Capturing current d-i syslog for test case 76664dbf-3937-4ae9-88b4-7c1320b3669e
DEBUG:root:May 12 10:14:22 in-target: debconf (developer): ----> DATA debconf-apt-progress/info type text
May 12 10:14:22 debconf: --> DATA debconf-apt-progress/info type text
May 12 10:14:22 debconf: <-- 0 OK
May 12 10:14:22 in-target: debconf (developer): <---- 0 OK
May 12 10:14:22 in-target: debconf (developer): ----> DATA debconf-apt-progress/info description Unpacking libavahi-common-data
May 12 10:14:22 debconf: --> DATA debconf-apt-progress/info description Unpacking libavahi-common-data
May 12 10:14:22 debconf: <-- 0 OK
May 12 10:14:22 in-target: debconf (developer): <---- 0 OK
May 12 10:14:22 in-target: debconf (developer): ----> PROGRESS INFO debconf-apt-progress/info
May 12 10:14:22 debconf: --> PROGRESS INFO debconf-apt-progress/info
DEBUG:root:Checking VM state for test case 76664dbf-3937-4ae9-88b4-7c1320b3669e
DEBUG:root:Cmd: ['virsh', 'domstate', '76664dbf-3937-4ae9-88b4-7c1320b3669e']
DEBUG:root:running
DEBUG:root:Capturing current d-i syslog for test case 76664dbf-3937-4ae9-88b4-7c1320b3669e
DEBUG:root:May 12 10:14:50 in-target: done
May 12 10:14:50 in-target:   en_NZ.UTF-8... 
May 12 10:14:51 in-target: done
May 12 10:14:51 in-target:   en_PH.UTF-8... 
May 12 10:14:52 in-target: done
May 12 10:14:52 in-target:   en_SG.UTF-8... 
May 12 10:14:53 in-target: done
May 12 10:14:53 in-target:   en_US.UTF-8... 
May 12 10:14:53 in-target: up-to-date
May 12 10:14:53 in-target:   en_ZA.UTF-8...
DEBUG:root:Checking VM state for test case 76664dbf-3937-4ae9-88b4-7c1320b3669e
DEBUG:root:Cmd: ['virsh', 'domstate', '76664dbf-3937-4ae9-88b4-7c1320b3669e']
DEBUG:root:running
DEBUG:root:Capturing current d-i syslog for test case 76664dbf-3937-4ae9-88b4-7c1320b3669e
DEBUG:root:May 12 10:15:23 in-target: 
May 12 10:15:23 in-target: Creating config file /etc/default/grub with new version
May 12 10:15:24 in-target: debconf (developer): <-- GET grub-pc/install_devices
May 12 10:15:24 in-target: debconf (developer): --> 0 
May 12 10:15:24 in-target: debconf (developer): <-- SET grub-pc/install_devices 
May 12 10:15:24 in-target: debconf (developer): --> 0 value set
May 12 10:15:24 in-target: debconf (developer): <-- FSET grub-pc/install_devices seen false
May 12 10:15:24 in-target: debconf (developer): --> 0 false
May 12 10:15:24 in-target: debconf (developer): <-- FSET grub-pc/install_devices_empty seen false
May 12 10:15:24 in-target: debconf (developer): --> 0 false
DEBUG:root:Checking VM state for test case 76664dbf-3937-4ae9-88b4-7c1320b3669e
DEBUG:root:Cmd: ['virsh', 'domstate', '76664dbf-3937-4ae9-88b4-7c1320b3669e']
DEBUG:root:running
DEBUG:root:Capturing current d-i syslog for test case 76664dbf-3937-4ae9-88b4-7c1320b3669e
DEBUG:root:May 12 10:15:38 debconf: <-- 0 OK
May 12 10:15:38 finish-install: info: Running /usr/lib/finish-install.d/90console
May 12 10:15:38 debconf: --> GET finish-install/keep-consoles
May 12 10:15:38 debconf: <-- 0 false
May 12 10:15:38 debconf: --> PROGRESS STEP 1
May 12 10:15:38 debconf: <-- 0 OK
May 12 10:15:38 debconf: --> PROGRESS INFO finish-install/progress/save-logs
May 12 10:15:38 debconf: <-- 0 OK
May 12 10:15:38 finish-install: info: Running /usr/lib/finish-install.d/94save-logs
May 12 10:15:38 debconf: --> X_SAVE
DEBUG:root:Checking VM state for test case 76664dbf-3937-4ae9-88b4-7c1320b3669e
DEBUG:root:Cmd: ['virsh', 'domstate', '76664dbf-3937-4ae9-88b4-7c1320b3669e']
DEBUG:root:running
DEBUG:root:Capturing current d-i syslog for test case 76664dbf-3937-4ae9-88b4-7c1320b3669e
DEBUG:root:May 12 10:15:38 debconf: <-- 0 OK
May 12 10:15:38 finish-install: info: Running /usr/lib/finish-install.d/90console
May 12 10:15:38 debconf: --> GET finish-install/keep-consoles
May 12 10:15:38 debconf: <-- 0 false
May 12 10:15:38 debconf: --> PROGRESS STEP 1
May 12 10:15:38 debconf: <-- 0 OK
May 12 10:15:38 debconf: --> PROGRESS INFO finish-install/progress/save-logs
May 12 10:15:38 debconf: <-- 0 OK
May 12 10:15:38 finish-install: info: Running /usr/lib/finish-install.d/94save-logs
May 12 10:15:38 debconf: --> X_SAVE
DEBUG:root:Checking VM state for test case 76664dbf-3937-4ae9-88b4-7c1320b3669e
DEBUG:root:Cmd: ['virsh', 'domstate', '76664dbf-3937-4ae9-88b4-7c1320b3669e']
DEBUG:root:running
DEBUG:root:Capturing current d-i syslog for test case 76664dbf-3937-4ae9-88b4-7c1320b3669e
DEBUG:root:May 12 10:15:38 debconf: <-- 0 OK
May 12 10:15:38 finish-install: info: Running /usr/lib/finish-install.d/90console
May 12 10:15:38 debconf: --> GET finish-install/keep-consoles
May 12 10:15:38 debconf: <-- 0 false
May 12 10:15:38 debconf: --> PROGRESS STEP 1
May 12 10:15:38 debconf: <-- 0 OK
May 12 10:15:38 debconf: --> PROGRESS INFO finish-install/progress/save-logs
May 12 10:15:38 debconf: <-- 0 OK
May 12 10:15:38 finish-install: info: Running /usr/lib/finish-install.d/94save-logs
May 12 10:15:38 debconf: --> X_SAVE
DEBUG:root:Checking VM state for test case 76664dbf-3937-4ae9-88b4-7c1320b3669e
DEBUG:root:Cmd: ['virsh', 'domstate', '76664dbf-3937-4ae9-88b4-7c1320b3669e']
DEBUG:root:running
DEBUG:root:Capturing current d-i syslog for test case 76664dbf-3937-4ae9-88b4-7c1320b3669e
DEBUG:root:May 12 10:15:38 debconf: <-- 0 OK
May 12 10:15:38 finish-install: info: Running /usr/lib/finish-install.d/90console
May 12 10:15:38 debconf: --> GET finish-install/keep-consoles
May 12 10:15:38 debconf: <-- 0 false
May 12 10:15:38 debconf: --> PROGRESS STEP 1
May 12 10:15:38 debconf: <-- 0 OK
May 12 10:15:38 debconf: --> PROGRESS INFO finish-install/progress/save-logs
May 12 10:15:38 debconf: <-- 0 OK
May 12 10:15:38 finish-install: info: Running /usr/lib/finish-install.d/94save-logs
May 12 10:15:38 debconf: --> X_SAVE
DEBUG:root:Checking VM state for test case 76664dbf-3937-4ae9-88b4-7c1320b3669e
DEBUG:root:Cmd: ['virsh', 'domstate', '76664dbf-3937-4ae9-88b4-7c1320b3669e']
DEBUG:root:shut off
DEBUG:root:VM powered off for test case 76664dbf-3937-4ae9-88b4-7c1320b3669e
DEBUG:root:test[iso_url]=/var/lib/ubuntu-iso-testing/isos/ubuntu-server/precise-server-i386.iso
DEBUG:root:test[post-reboot-results]={'lamp-reboot': {'started': '2014-05-12T10:17:12.848045', 'script_stdout': '<testsuite errors="0" failures="0" name="" tests="1" time="0.047">\n<testcase classname="test.DefaultTest" name="test_recorded_state" time="0.038"/>\n</testsuite>\n', 'finished': '2014-05-12T10:17:13.142330', 'returncode': 0, 'script_stderr': u''}}
DEBUG:root:test[_rev]=22-49e0eca3cf1a7a711a89b75e4317c0e2
DEBUG:root:test[disks]=[{'bus': 'virtio', 'size': '2G', 'target': 'vda', 'format': 'qcow2'}]
DEBUG:root:test[results]={'lamp-reboot': {'started': '2014-05-12T10:16:27.767015', 'script_stdout': 'error: setUpClass (test.LampRebootTest) [\nTraceback (most recent call last):\n  File "test.py", line 37, in setUpClass\n    subprocess.check_call([\'tasksel\',\'install\',\'lamp-server\'],env=env)\n  File "/usr/lib/python2.7/subprocess.py", line 511, in check_call\n    raise CalledProcessError(retcode, cmd)\nCalledProcessError: Command \'[\'tasksel\', \'install\', \'lamp-server\']\' returned non-zero exit status 1\n]\n<testsuite errors="0" failures="0" name="" tests="0" time="5.183">\n</testsuite>\n', 'finished': '2014-05-12T10:16:33.504835', 'returncode': 0, 'script_stderr': 'tasksel: aptitude failed (100)\n'}}
DEBUG:root:test[_attachments]={'pxe/kernel': {'stub': True, 'length': 5967360, 'digest': 'md5-LuKuMGflUpfWt2C3uHIbEA==', 'revpos': 6, 'content_type': u''}, 'tests/lamp-reboot': {'stub': True, 'length': 3094, 'digest': 'md5-yg8o6cvz1/duHxbwe3Bmfw==', 'revpos': 8, 'content_type': u''}, 'post-reboot-tests/lamp-reboot': {'stub': True, 'length': 1458, 'digest': 'md5-cWfzL+xCNII6ijRKLvoI2w==', 'revpos': 9, 'content_type': u''}, 'pxe/pxelinux.cfg/52:54:00:f2:de:cf': {'stub': True, 'length': 1108, 'digest': 'md5-m3h5F/RU9QYXCoEPYxxERg==', 'revpos': 7, 'content_type': u''}, 'libvirt.xml': {'stub': True, 'length': 2031, 'digest': 'md5-mVqNeaCNTLC6jLi2AXPs8Q==', 'revpos': 12, 'content_type': 'application/xml'}, 'preseed': {'stub': True, 'length': 13166, 'digest': 'md5-T0l/HjezUKTvZWBmG6gvow==', 'revpos': 2, 'content_type': u''}, 'pxe/initrd': {'stub': True, 'length': 6643925, 'digest': 'md5-aZ7nZ8e9EBv3MmpfULWx/A==', 'revpos': 5, 'content_type': u''}, 'media_info': {'stub': True, 'length': 70, 'digest': 'md5-4od2+pr0lmj3teg7QVVjOQ==', 'revpos': 3, 'content_type': u''}, 'run_test': {'stub': True, 'length': 6943, 'digest': 'md5-ZbbgRpEcHSeMP9A+cvAv1Q==', 'revpos': 4, 'content_type': u''}}
DEBUG:root:test[states]={'rebooted': '2014-05-12T10:16:33.603132', 'creating': '2014-05-12T10:09:46.712611', 'created': '2014-05-12T10:09:52.217962', 'started': '2014-05-12T10:09:53.940213', 'configured': '2014-05-12T10:09:52.538045', 'testing': '2014-05-12T10:17:12.804795', 'tested': '2014-05-12T10:17:13.197067'}
DEBUG:root:test[mac]=52:54:00:f2:de:cf
DEBUG:root:test[_id]=76664dbf-3937-4ae9-88b4-7c1320b3669e
DEBUG:root:test[test_case]=lamp-reboot
DEBUG:root:Tests completed for test case 76664dbf-3937-4ae9-88b4-7c1320b3669e
DEBUG:root:Storing results for test lamp-reboot
DEBUG:root:Reboot tests completed for test case 76664dbf-3937-4ae9-88b4-7c1320b3669e
DEBUG:root:Storing results for test lamp-reboot
DEBUG:root:Undefine VM for  test case 76664dbf-3937-4ae9-88b4-7c1320b3669e
DEBUG:root:Cmd: ['virsh', 'undefine', '76664dbf-3937-4ae9-88b4-7c1320b3669e']
Domain 76664dbf-3937-4ae9-88b4-7c1320b3669e has been undefined

DEBUG:root:Collating output for test case 76664dbf-3937-4ae9-88b4-7c1320b3669e
Archiving artifacts
Recording test results
ERROR: Failed to archive test reports
hudson.util.IOException2: remote file operation failed: <http://d-jenkins.ubuntu-ci:8080/job/precise-server-i386_lamp-reboot/ws/> at hudson.remoting.Channel at 1475143b:wazn
	at hudson.FilePath.act(FilePath.java:848)
	at hudson.FilePath.act(FilePath.java:834)
	at hudson.tasks.junit.JUnitParser.parse(JUnitParser.java:87)
	at hudson.tasks.junit.JUnitResultArchiver.parse(JUnitResultArchiver.java:122)
	at hudson.tasks.junit.JUnitResultArchiver.perform(JUnitResultArchiver.java:134)
	at hudson.tasks.BuildStepMonitor$1.perform(BuildStepMonitor.java:19)
	at hudson.model.AbstractBuild$AbstractBuildExecution.perform(AbstractBuild.java:718)
	at hudson.model.AbstractBuild$AbstractBuildExecution.performAllBuildSteps(AbstractBuild.java:693)
	at hudson.model.Build$BuildExecution.post2(Build.java:183)
	at hudson.model.AbstractBuild$AbstractBuildExecution.post(AbstractBuild.java:640)
	at hudson.model.Run.execute(Run.java:1527)
	at hudson.model.FreeStyleBuild.run(FreeStyleBuild.java:46)
	at hudson.model.ResourceController.execute(ResourceController.java:88)
	at hudson.model.Executor.run(Executor.java:237)
Caused by: hudson.util.IOException2: Failed to read <http://d-jenkins.ubuntu-ci:8080/job/precise-server-i386_lamp-reboot/671/artifact/671/test-results/TEST-lamp-reboot.xml>
	at hudson.tasks.junit.TestResult.parse(TestResult.java:244)
	at hudson.tasks.junit.TestResult.parse(TestResult.java:163)
	at hudson.tasks.junit.TestResult.parse(TestResult.java:140)
	at hudson.tasks.junit.TestResult.<init>(TestResult.java:116)
	at hudson.tasks.junit.JUnitParser$ParseResultCallable.invoke(JUnitParser.java:117)
	at hudson.tasks.junit.JUnitParser$ParseResultCallable.invoke(JUnitParser.java:90)
	at hudson.FilePath$FileCallableWrapper.call(FilePath.java:2246)
	at hudson.remoting.UserRequest.perform(UserRequest.java:118)
	at hudson.remoting.UserRequest.perform(UserRequest.java:48)
	at hudson.remoting.Request$2.run(Request.java:326)
	at hudson.remoting.InterceptingExecutorService$1.call(InterceptingExecutorService.java:72)
	at java.util.concurrent.FutureTask.run(FutureTask.java:262)
	at java.util.concurrent.ThreadPoolExecutor.runWorker(ThreadPoolExecutor.java:1145)
	at java.util.concurrent.ThreadPoolExecutor$Worker.run(ThreadPoolExecutor.java:615)
	at hudson.remoting.Engine$1$1.run(Engine.java:58)
	at java.lang.Thread.run(Thread.java:744)
Caused by: org.dom4j.DocumentException: Error on line 1 of document file://<http://d-jenkins.ubuntu-ci:8080/job/precise-server-i386_lamp-reboot/671/artifact/671/test-results/TEST-lamp-reboot.xml> : Content is not allowed in prolog. Nested exception: Content is not allowed in prolog.
	at org.dom4j.io.SAXReader.read(SAXReader.java:482)
	at org.dom4j.io.SAXReader.read(SAXReader.java:264)
	at hudson.tasks.junit.SuiteResult.parse(SuiteResult.java:116)
	at hudson.tasks.junit.TestResult.parse(TestResult.java:227)
	... 15 more
Caused by: org.xml.sax.SAXParseException; systemId: file://<http://d-jenkins.ubuntu-ci:8080/job/precise-server-i386_lamp-reboot/671/artifact/671/test-results/TEST-lamp-reboot.xml;> lineNumber: 1; columnNumber: 1; Content is not allowed in prolog.
	at com.sun.org.apache.xerces.internal.util.ErrorHandlerWrapper.createSAXParseException(ErrorHandlerWrapper.java:198)
	at com.sun.org.apache.xerces.internal.util.ErrorHandlerWrapper.fatalError(ErrorHandlerWrapper.java:177)
	at com.sun.org.apache.xerces.internal.impl.XMLErrorReporter.reportError(XMLErrorReporter.java:441)
	at com.sun.org.apache.xerces.internal.impl.XMLErrorReporter.reportError(XMLErrorReporter.java:368)
	at com.sun.org.apache.xerces.internal.impl.XMLScanner.reportFatalError(XMLScanner.java:1436)
	at com.sun.org.apache.xerces.internal.impl.XMLDocumentScannerImpl$PrologDriver.next(XMLDocumentScannerImpl.java:999)
	at com.sun.org.apache.xerces.internal.impl.XMLDocumentScannerImpl.next(XMLDocumentScannerImpl.java:606)
	at com.sun.org.apache.xerces.internal.impl.XMLNSDocumentScannerImpl.next(XMLNSDocumentScannerImpl.java:117)
	at com.sun.org.apache.xerces.internal.impl.XMLDocumentFragmentScannerImpl.scanDocument(XMLDocumentFragmentScannerImpl.java:510)
	at com.sun.org.apache.xerces.internal.parsers.XML11Configuration.parse(XML11Configuration.java:848)
	at com.sun.org.apache.xerces.internal.parsers.XML11Configuration.parse(XML11Configuration.java:777)
	at com.sun.org.apache.xerces.internal.parsers.XMLParser.parse(XMLParser.java:141)
	at com.sun.org.apache.xerces.internal.parsers.AbstractSAXParser.parse(AbstractSAXParser.java:1213)
	at com.sun.org.apache.xerces.internal.jaxp.SAXParserImpl$JAXPSAXParser.parse(SAXParserImpl.java:649)
	at org.dom4j.io.SAXReader.read(SAXReader.java:465)
	... 18 more
Build step 'Publish JUnit test result report' changed build result to FAILURE
Description set: 20140512



More information about the ubuntu-testing-notifications mailing list