Build failed in Jenkins: precise-server-i386_lamp-reboot #669
Jenkins Notification
devnull at canonical.com
Fri May 9 10:33:27 UTC 2014
See <http://d-jenkins.ubuntu-ci:8080/job/precise-server-i386_lamp-reboot/669/>
------------------------------------------
[...truncated 155 lines...]
DEBUG:root:running
DEBUG:root:Capturing current d-i syslog for test case 9f25ce85-cf3a-4855-8024-3c82d1b4b2ae
DEBUG:root:May 9 10:27:54 in-target: debconf (developer): <---- 0 OK
May 9 10:27:54 in-target: debconf (developer): ----> DATA debconf-apt-progress/info description Preparing linux-firmware
May 9 10:27:54 debconf: --> DATA debconf-apt-progress/info description Preparing linux-firmware
May 9 10:27:54 debconf: <-- 0 OK
May 9 10:27:54 in-target: debconf (developer): <---- 0 OK
May 9 10:27:54 in-target: debconf (developer): ----> PROGRESS INFO debconf-apt-progress/info
May 9 10:27:54 debconf: --> PROGRESS INFO debconf-apt-progress/info
May 9 10:27:54 debconf: <-- 0 OK
May 9 10:27:54 in-target: debconf (developer): <---- 0 OK
May 9 10:27:54 in-target: debconf (developer): --> 0 OK
DEBUG:root:Checking VM state for test case 9f25ce85-cf3a-4855-8024-3c82d1b4b2ae
DEBUG:root:Cmd: ['virsh', 'domstate', '9f25ce85-cf3a-4855-8024-3c82d1b4b2ae']
DEBUG:root:running
DEBUG:root:Capturing current d-i syslog for test case 9f25ce85-cf3a-4855-8024-3c82d1b4b2ae
DEBUG:root:May 9 10:28:25 in-target: debconf (developer): ----> DATA debconf-apt-progress/info description Retrieving file 9 of 42
May 9 10:28:25 debconf: --> DATA debconf-apt-progress/info description Retrieving file 9 of 42
May 9 10:28:25 debconf: <-- 0 OK
May 9 10:28:25 in-target: debconf (developer): <---- 0 OK
May 9 10:28:25 in-target: debconf (developer): ----> PROGRESS INFO debconf-apt-progress/info
May 9 10:28:25 debconf: --> PROGRESS INFO debconf-apt-progress/info
May 9 10:28:25 debconf: <-- 0 OK
May 9 10:28:25 in-target: debconf (developer): <---- 0 OK
May 9 10:28:25 in-target: debconf (developer): --> 0 OK
May 9 10:28:25 in-target: debconf (developer): <-- PROGRESS SET 773
DEBUG:root:Checking VM state for test case 9f25ce85-cf3a-4855-8024-3c82d1b4b2ae
DEBUG:root:Cmd: ['virsh', 'domstate', '9f25ce85-cf3a-4855-8024-3c82d1b4b2ae']
DEBUG:root:running
DEBUG:root:Capturing current d-i syslog for test case 9f25ce85-cf3a-4855-8024-3c82d1b4b2ae
DEBUG:root:May 9 10:28:54 in-target: debconf (developer): <---- 0 OK
May 9 10:28:54 in-target: debconf (developer): ----> DATA debconf-apt-progress/info description Retrieving file 6 of 28
May 9 10:28:54 debconf: --> DATA debconf-apt-progress/info description Retrieving file 6 of 28
May 9 10:28:54 debconf: <-- 0 OK
May 9 10:28:54 in-target: debconf (developer): <---- 0 OK
May 9 10:28:54 in-target: debconf (developer): ----> PROGRESS INFO debconf-apt-progress/info
May 9 10:28:54 debconf: --> PROGRESS INFO debconf-apt-progress/info
May 9 10:28:54 debconf: <-- 0 OK
May 9 10:28:54 in-target: debconf (developer): <---- 0 OK
May 9 10:28:54 in-target: debconf (developer): --> 0 OK
DEBUG:root:Checking VM state for test case 9f25ce85-cf3a-4855-8024-3c82d1b4b2ae
DEBUG:root:Cmd: ['virsh', 'domstate', '9f25ce85-cf3a-4855-8024-3c82d1b4b2ae']
DEBUG:root:running
DEBUG:root:Capturing current d-i syslog for test case 9f25ce85-cf3a-4855-8024-3c82d1b4b2ae
DEBUG:root:May 9 10:29:21 in-target: debconf (developer): <---- 0 OK
May 9 10:29:21 in-target: debconf (developer): ----> DATA debconf-apt-progress/info description Preparing apparmor
May 9 10:29:21 debconf: --> DATA debconf-apt-progress/info description Preparing apparmor
May 9 10:29:21 debconf: <-- 0 OK
May 9 10:29:21 in-target: debconf (developer): <---- 0 OK
May 9 10:29:21 in-target: debconf (developer): ----> PROGRESS INFO debconf-apt-progress/info
May 9 10:29:21 debconf: --> PROGRESS INFO debconf-apt-progress/info
May 9 10:29:21 debconf: <-- 0 OK
May 9 10:29:21 in-target: debconf (developer): <---- 0 OK
May 9 10:29:21 in-target: debconf (developer): --> 0 OK
DEBUG:root:Checking VM state for test case 9f25ce85-cf3a-4855-8024-3c82d1b4b2ae
DEBUG:root:Cmd: ['virsh', 'domstate', '9f25ce85-cf3a-4855-8024-3c82d1b4b2ae']
DEBUG:root:running
DEBUG:root:Capturing current d-i syslog for test case 9f25ce85-cf3a-4855-8024-3c82d1b4b2ae
DEBUG:root:May 9 10:29:54 in-target: debconf (developer): ----> DATA debconf-apt-progress/info description Configuring libkeyutils1
May 9 10:29:54 debconf: --> DATA debconf-apt-progress/info description Configuring libkeyutils1
May 9 10:29:54 debconf: <-- 0 OK
May 9 10:29:54 in-target: debconf (developer): <---- 0 OK
May 9 10:29:54 in-target: debconf (developer): ----> PROGRESS INFO debconf-apt-progress/info
May 9 10:29:54 debconf: --> PROGRESS INFO debconf-apt-progress/info
May 9 10:29:54 debconf: <-- 0 OK
May 9 10:29:54 in-target: debconf (developer): <---- 0 OK
May 9 10:29:54 in-target: debconf (developer): --> 0 OK
May 9 10:29:54 in-t
DEBUG:root:Checking VM state for test case 9f25ce85-cf3a-4855-8024-3c82d1b4b2ae
DEBUG:root:Cmd: ['virsh', 'domstate', '9f25ce85-cf3a-4855-8024-3c82d1b4b2ae']
DEBUG:root:running
DEBUG:root:Capturing current d-i syslog for test case 9f25ce85-cf3a-4855-8024-3c82d1b4b2ae
DEBUG:root:May 9 10:30:25 in-target: debconf (developer): <-- PROGRESS INFO debconf-apt-progress/info
May 9 10:30:25 in-target: debconf (developer): ----> DATA debconf-apt-progress/info type text
May 9 10:30:25 debconf: --> DATA debconf-apt-progress/info type text
May 9 10:30:25 debconf: <-- 0 OK
May 9 10:30:25 in-target: debconf (developer): <---- 0 OK
May 9 10:30:25 in-target: debconf (developer): ----> DATA debconf-apt-progress/info description Retrieving file 11 of 55
May 9 10:30:25 debconf: --> DATA debconf-apt-progress/info description Retrieving file 11 of 55
May 9 10:30:25 debconf: <-- 0 OK
May 9 10:30:25 in-target: debconf (developer): <---- 0 OK
May 9 10:30:25 in-target: debco
DEBUG:root:Checking VM state for test case 9f25ce85-cf3a-4855-8024-3c82d1b4b2ae
DEBUG:root:Cmd: ['virsh', 'domstate', '9f25ce85-cf3a-4855-8024-3c82d1b4b2ae']
DEBUG:root:running
DEBUG:root:Capturing current d-i syslog for test case 9f25ce85-cf3a-4855-8024-3c82d1b4b2ae
DEBUG:root:May 9 10:30:50 in-target: Generating locales...
May 9 10:30:50 in-target: en_AG.UTF-8...
May 9 10:30:51 in-target: done
May 9 10:30:51 in-target: en_AU.UTF-8...
May 9 10:30:52 in-target: done
May 9 10:30:52 in-target: en_BW.UTF-8...
May 9 10:30:53 in-target: done
May 9 10:30:53 in-target: en_CA.UTF-8...
May 9 10:30:54 in-target: done
May 9 10:30:54 in-target: en_DK.UTF-8...
DEBUG:root:Checking VM state for test case 9f25ce85-cf3a-4855-8024-3c82d1b4b2ae
DEBUG:root:Cmd: ['virsh', 'domstate', '9f25ce85-cf3a-4855-8024-3c82d1b4b2ae']
DEBUG:root:running
DEBUG:root:Capturing current d-i syslog for test case 9f25ce85-cf3a-4855-8024-3c82d1b4b2ae
DEBUG:root:May 9 10:31:24 in-target: debconf (developer): frontend started
May 9 10:31:24 in-target: debconf (developer): Trying to find a templates file..
May 9 10:31:24 in-target: debconf (developer): Trying /usr/bin/debconf-apt-progress.templates
May 9 10:31:24 in-target: debconf (developer): Trying /usr/share/debconf/templates/debconf-apt-progress.templates
May 9 10:31:24 in-target: debconf (developer): Couldn't find a templates file.
May 9 10:31:24 in-target: debconf (developer): frontend running, package name is
May 9 10:31:24 in-target: debconf (developer): starting /usr/bin/debconf-apt-progress --no-progress --logstderr -- apt-get -q -y --no-remove install grub-common
May 9 10:31:24 in-target: debconf (developer): <-- GET debconf/priority
May 9 10:31:24 in-target: debconf (developer): --> 0 high
May 9 10:31:24 in-target: Reading package lists...
DEBUG:root:Checking VM state for test case 9f25ce85-cf3a-4855-8024-3c82d1b4b2ae
DEBUG:root:Cmd: ['virsh', 'domstate', '9f25ce85-cf3a-4855-8024-3c82d1b4b2ae']
DEBUG:root:running
DEBUG:root:Capturing current d-i syslog for test case 9f25ce85-cf3a-4855-8024-3c82d1b4b2ae
DEBUG:root:May 9 10:31:50 finish-install: info: Running /usr/lib/finish-install.d/90console
May 9 10:31:50 debconf: --> GET finish-install/keep-consoles
May 9 10:31:50 debconf: <-- 0 false
May 9 10:31:50 debconf: --> PROGRESS STEP 1
May 9 10:31:50 debconf: <-- 0 OK
May 9 10:31:50 debconf: --> PROGRESS INFO finish-install/progress/save-logs
May 9 10:31:50 debconf: <-- 0 OK
May 9 10:31:50 finish-install: info: Running /usr/lib/finish-install.d/94save-logs
May 9 10:31:50 debconf: --> X_SAVE
May 9 10:31:50 debconf: <-- 0 OK
DEBUG:root:Checking VM state for test case 9f25ce85-cf3a-4855-8024-3c82d1b4b2ae
DEBUG:root:Cmd: ['virsh', 'domstate', '9f25ce85-cf3a-4855-8024-3c82d1b4b2ae']
DEBUG:root:running
DEBUG:root:Capturing current d-i syslog for test case 9f25ce85-cf3a-4855-8024-3c82d1b4b2ae
DEBUG:root:May 9 10:31:50 finish-install: info: Running /usr/lib/finish-install.d/90console
May 9 10:31:50 debconf: --> GET finish-install/keep-consoles
May 9 10:31:50 debconf: <-- 0 false
May 9 10:31:50 debconf: --> PROGRESS STEP 1
May 9 10:31:50 debconf: <-- 0 OK
May 9 10:31:50 debconf: --> PROGRESS INFO finish-install/progress/save-logs
May 9 10:31:50 debconf: <-- 0 OK
May 9 10:31:50 finish-install: info: Running /usr/lib/finish-install.d/94save-logs
May 9 10:31:50 debconf: --> X_SAVE
May 9 10:31:50 debconf: <-- 0 OK
DEBUG:root:Checking VM state for test case 9f25ce85-cf3a-4855-8024-3c82d1b4b2ae
DEBUG:root:Cmd: ['virsh', 'domstate', '9f25ce85-cf3a-4855-8024-3c82d1b4b2ae']
DEBUG:root:running
DEBUG:root:Capturing current d-i syslog for test case 9f25ce85-cf3a-4855-8024-3c82d1b4b2ae
DEBUG:root:May 9 10:31:50 finish-install: info: Running /usr/lib/finish-install.d/90console
May 9 10:31:50 debconf: --> GET finish-install/keep-consoles
May 9 10:31:50 debconf: <-- 0 false
May 9 10:31:50 debconf: --> PROGRESS STEP 1
May 9 10:31:50 debconf: <-- 0 OK
May 9 10:31:50 debconf: --> PROGRESS INFO finish-install/progress/save-logs
May 9 10:31:50 debconf: <-- 0 OK
May 9 10:31:50 finish-install: info: Running /usr/lib/finish-install.d/94save-logs
May 9 10:31:50 debconf: --> X_SAVE
May 9 10:31:50 debconf: <-- 0 OK
DEBUG:root:Checking VM state for test case 9f25ce85-cf3a-4855-8024-3c82d1b4b2ae
DEBUG:root:Cmd: ['virsh', 'domstate', '9f25ce85-cf3a-4855-8024-3c82d1b4b2ae']
DEBUG:root:running
DEBUG:root:Capturing current d-i syslog for test case 9f25ce85-cf3a-4855-8024-3c82d1b4b2ae
DEBUG:root:May 9 10:31:50 finish-install: info: Running /usr/lib/finish-install.d/90console
May 9 10:31:50 debconf: --> GET finish-install/keep-consoles
May 9 10:31:50 debconf: <-- 0 false
May 9 10:31:50 debconf: --> PROGRESS STEP 1
May 9 10:31:50 debconf: <-- 0 OK
May 9 10:31:50 debconf: --> PROGRESS INFO finish-install/progress/save-logs
May 9 10:31:50 debconf: <-- 0 OK
May 9 10:31:50 finish-install: info: Running /usr/lib/finish-install.d/94save-logs
May 9 10:31:50 debconf: --> X_SAVE
May 9 10:31:50 debconf: <-- 0 OK
DEBUG:root:Checking VM state for test case 9f25ce85-cf3a-4855-8024-3c82d1b4b2ae
DEBUG:root:Cmd: ['virsh', 'domstate', '9f25ce85-cf3a-4855-8024-3c82d1b4b2ae']
DEBUG:root:shut off
DEBUG:root:VM powered off for test case 9f25ce85-cf3a-4855-8024-3c82d1b4b2ae
DEBUG:root:test[iso_url]=/var/lib/ubuntu-iso-testing/isos/ubuntu-server/precise-server-i386.iso
DEBUG:root:test[post-reboot-results]={'lamp-reboot': {'started': '2014-05-09T10:33:21.985916', 'script_stdout': '<testsuite errors="0" failures="0" name="" tests="1" time="0.047">\n<testcase classname="test.DefaultTest" name="test_recorded_state" time="0.042"/>\n</testsuite>\n', 'finished': '2014-05-09T10:33:22.317187', 'returncode': 0, 'script_stderr': u''}}
DEBUG:root:test[_rev]=22-f3f96e1448dbf357f3a7530e044b8b13
DEBUG:root:test[disks]=[{'bus': 'virtio', 'size': '2G', 'target': 'vda', 'format': 'qcow2'}]
DEBUG:root:test[results]={'lamp-reboot': {'started': '2014-05-09T10:32:33.596852', 'script_stdout': 'error: setUpClass (test.LampRebootTest) [\nTraceback (most recent call last):\n File "test.py", line 37, in setUpClass\n subprocess.check_call([\'tasksel\',\'install\',\'lamp-server\'],env=env)\n File "/usr/lib/python2.7/subprocess.py", line 511, in check_call\n raise CalledProcessError(retcode, cmd)\nCalledProcessError: Command \'[\'tasksel\', \'install\', \'lamp-server\']\' returned non-zero exit status 1\n]\n<testsuite errors="0" failures="0" name="" tests="0" time="9.767">\n</testsuite>\n', 'finished': '2014-05-09T10:32:43.728419', 'returncode': 0, 'script_stderr': 'tasksel: aptitude failed (100)\n'}}
DEBUG:root:test[_attachments]={'pxe/kernel': {'stub': True, 'length': 5967360, 'digest': 'md5-LuKuMGflUpfWt2C3uHIbEA==', 'revpos': 6, 'content_type': u''}, 'tests/lamp-reboot': {'stub': True, 'length': 3094, 'digest': 'md5-yg8o6cvz1/duHxbwe3Bmfw==', 'revpos': 8, 'content_type': u''}, 'post-reboot-tests/lamp-reboot': {'stub': True, 'length': 1458, 'digest': 'md5-cWfzL+xCNII6ijRKLvoI2w==', 'revpos': 9, 'content_type': u''}, 'libvirt.xml': {'stub': True, 'length': 2031, 'digest': 'md5-N80thvMDlGiLiY97WyMAyA==', 'revpos': 12, 'content_type': 'application/xml'}, 'preseed': {'stub': True, 'length': 13166, 'digest': 'md5-QObQZWW0Wq4Cni8hNio7Wg==', 'revpos': 2, 'content_type': u''}, 'pxe/initrd': {'stub': True, 'length': 6643216, 'digest': 'md5-w96aslIEqWOTnAJYJcMkeQ==', 'revpos': 5, 'content_type': u''}, 'media_info': {'stub': True, 'length': 70, 'digest': 'md5-rbhMtYXzW/1t8sS5DTR74A==', 'revpos': 3, 'content_type': u''}, 'pxe/pxelinux.cfg/52:54:00:70:54:b0': {'stub': True, 'length': 1108, 'digest': 'md5-GwOvPC3bANvdmEHdqe+QEQ==', 'revpos': 7, 'content_type': u''}, 'run_test': {'stub': True, 'length': 6943, 'digest': 'md5-ZbbgRpEcHSeMP9A+cvAv1Q==', 'revpos': 4, 'content_type': u''}}
DEBUG:root:test[states]={'rebooted': '2014-05-09T10:32:43.818900', 'creating': '2014-05-09T10:24:09.233216', 'created': '2014-05-09T10:24:16.401940', 'started': '2014-05-09T10:24:25.243075', 'configured': '2014-05-09T10:24:16.833991', 'testing': '2014-05-09T10:33:21.938459', 'tested': '2014-05-09T10:33:22.369817'}
DEBUG:root:test[mac]=52:54:00:70:54:b0
DEBUG:root:test[_id]=9f25ce85-cf3a-4855-8024-3c82d1b4b2ae
DEBUG:root:test[test_case]=lamp-reboot
DEBUG:root:Tests completed for test case 9f25ce85-cf3a-4855-8024-3c82d1b4b2ae
DEBUG:root:Storing results for test lamp-reboot
DEBUG:root:Reboot tests completed for test case 9f25ce85-cf3a-4855-8024-3c82d1b4b2ae
DEBUG:root:Storing results for test lamp-reboot
DEBUG:root:Undefine VM for test case 9f25ce85-cf3a-4855-8024-3c82d1b4b2ae
DEBUG:root:Cmd: ['virsh', 'undefine', '9f25ce85-cf3a-4855-8024-3c82d1b4b2ae']
Domain 9f25ce85-cf3a-4855-8024-3c82d1b4b2ae has been undefined
DEBUG:root:Collating output for test case 9f25ce85-cf3a-4855-8024-3c82d1b4b2ae
Archiving artifacts
Recording test results
ERROR: Failed to archive test reports
hudson.util.IOException2: remote file operation failed: <http://d-jenkins.ubuntu-ci:8080/job/precise-server-i386_lamp-reboot/ws/> at hudson.remoting.Channel at 7978e2b7:wazn
at hudson.FilePath.act(FilePath.java:848)
at hudson.FilePath.act(FilePath.java:834)
at hudson.tasks.junit.JUnitParser.parse(JUnitParser.java:87)
at hudson.tasks.junit.JUnitResultArchiver.parse(JUnitResultArchiver.java:122)
at hudson.tasks.junit.JUnitResultArchiver.perform(JUnitResultArchiver.java:134)
at hudson.tasks.BuildStepMonitor$1.perform(BuildStepMonitor.java:19)
at hudson.model.AbstractBuild$AbstractBuildExecution.perform(AbstractBuild.java:718)
at hudson.model.AbstractBuild$AbstractBuildExecution.performAllBuildSteps(AbstractBuild.java:693)
at hudson.model.Build$BuildExecution.post2(Build.java:183)
at hudson.model.AbstractBuild$AbstractBuildExecution.post(AbstractBuild.java:640)
at hudson.model.Run.execute(Run.java:1527)
at hudson.model.FreeStyleBuild.run(FreeStyleBuild.java:46)
at hudson.model.ResourceController.execute(ResourceController.java:88)
at hudson.model.Executor.run(Executor.java:237)
Caused by: hudson.util.IOException2: Failed to read <http://d-jenkins.ubuntu-ci:8080/job/precise-server-i386_lamp-reboot/669/artifact/669/test-results/TEST-lamp-reboot.xml>
at hudson.tasks.junit.TestResult.parse(TestResult.java:244)
at hudson.tasks.junit.TestResult.parse(TestResult.java:163)
at hudson.tasks.junit.TestResult.parse(TestResult.java:140)
at hudson.tasks.junit.TestResult.<init>(TestResult.java:116)
at hudson.tasks.junit.JUnitParser$ParseResultCallable.invoke(JUnitParser.java:117)
at hudson.tasks.junit.JUnitParser$ParseResultCallable.invoke(JUnitParser.java:90)
at hudson.FilePath$FileCallableWrapper.call(FilePath.java:2246)
at hudson.remoting.UserRequest.perform(UserRequest.java:118)
at hudson.remoting.UserRequest.perform(UserRequest.java:48)
at hudson.remoting.Request$2.run(Request.java:326)
at hudson.remoting.InterceptingExecutorService$1.call(InterceptingExecutorService.java:72)
at java.util.concurrent.FutureTask.run(FutureTask.java:262)
at java.util.concurrent.ThreadPoolExecutor.runWorker(ThreadPoolExecutor.java:1145)
at java.util.concurrent.ThreadPoolExecutor$Worker.run(ThreadPoolExecutor.java:615)
at hudson.remoting.Engine$1$1.run(Engine.java:58)
at java.lang.Thread.run(Thread.java:744)
Caused by: org.dom4j.DocumentException: Error on line 1 of document file://<http://d-jenkins.ubuntu-ci:8080/job/precise-server-i386_lamp-reboot/669/artifact/669/test-results/TEST-lamp-reboot.xml> : Content is not allowed in prolog. Nested exception: Content is not allowed in prolog.
at org.dom4j.io.SAXReader.read(SAXReader.java:482)
at org.dom4j.io.SAXReader.read(SAXReader.java:264)
at hudson.tasks.junit.SuiteResult.parse(SuiteResult.java:116)
at hudson.tasks.junit.TestResult.parse(TestResult.java:227)
... 15 more
Caused by: org.xml.sax.SAXParseException; systemId: file://<http://d-jenkins.ubuntu-ci:8080/job/precise-server-i386_lamp-reboot/669/artifact/669/test-results/TEST-lamp-reboot.xml;> lineNumber: 1; columnNumber: 1; Content is not allowed in prolog.
at com.sun.org.apache.xerces.internal.util.ErrorHandlerWrapper.createSAXParseException(ErrorHandlerWrapper.java:198)
at com.sun.org.apache.xerces.internal.util.ErrorHandlerWrapper.fatalError(ErrorHandlerWrapper.java:177)
at com.sun.org.apache.xerces.internal.impl.XMLErrorReporter.reportError(XMLErrorReporter.java:441)
at com.sun.org.apache.xerces.internal.impl.XMLErrorReporter.reportError(XMLErrorReporter.java:368)
at com.sun.org.apache.xerces.internal.impl.XMLScanner.reportFatalError(XMLScanner.java:1436)
at com.sun.org.apache.xerces.internal.impl.XMLDocumentScannerImpl$PrologDriver.next(XMLDocumentScannerImpl.java:999)
at com.sun.org.apache.xerces.internal.impl.XMLDocumentScannerImpl.next(XMLDocumentScannerImpl.java:606)
at com.sun.org.apache.xerces.internal.impl.XMLNSDocumentScannerImpl.next(XMLNSDocumentScannerImpl.java:117)
at com.sun.org.apache.xerces.internal.impl.XMLDocumentFragmentScannerImpl.scanDocument(XMLDocumentFragmentScannerImpl.java:510)
at com.sun.org.apache.xerces.internal.parsers.XML11Configuration.parse(XML11Configuration.java:848)
at com.sun.org.apache.xerces.internal.parsers.XML11Configuration.parse(XML11Configuration.java:777)
at com.sun.org.apache.xerces.internal.parsers.XMLParser.parse(XMLParser.java:141)
at com.sun.org.apache.xerces.internal.parsers.AbstractSAXParser.parse(AbstractSAXParser.java:1213)
at com.sun.org.apache.xerces.internal.jaxp.SAXParserImpl$JAXPSAXParser.parse(SAXParserImpl.java:649)
at org.dom4j.io.SAXReader.read(SAXReader.java:465)
... 18 more
Build step 'Publish JUnit test result report' changed build result to FAILURE
Description set: 20140509
More information about the ubuntu-testing-notifications
mailing list