Build failed in Jenkins: precise-server-amd64_lamp-reboot #631

Jenkins Notification devnull at canonical.com
Wed Jan 22 16:49:27 UTC 2014


See <http://d-jenkins.ubuntu-ci:8080/job/precise-server-amd64_lamp-reboot/631/>

------------------------------------------
[...truncated 108 lines...]
Jan 22 16:43:25 debootstrap: debconf (developer): --> 0
Jan 22 16:43:25 debootstrap: debconf (developer): <-- GO 
Jan 22 16:43:25 debootstrap: debconf (developer): --> 0 ok
Jan 22 16:43:25 debootstrap: debconf (developer): starting /var/lib/dpkg/info/debconf.postinst configure 1.5.42ubuntu1
DEBUG:root:Checking VM state for test case dbe8a7ba-a185-41a6-8257-0e9816126a3a
DEBUG:root:Cmd: ['virsh', 'domstate', 'dbe8a7ba-a185-41a6-8257-0e9816126a3a']
DEBUG:root:running
DEBUG:root:Capturing current d-i syslog for test case dbe8a7ba-a185-41a6-8257-0e9816126a3a
DEBUG:root:Jan 22 16:43:49 debconf: <-- 0 multiselect backup progresscancel align plugin-terminal plugin-detect-keyboard
Jan 22 16:43:49 in-target: debconf (developer): <---- 0 multiselect backup progresscancel align plugin-terminal plugin-detect-keyboard
Jan 22 16:43:49 in-target: debconf (developer): --> 0 multiselect escape multiselect backup progresscancel align plugin-terminal plugin-detect-keyboard
Jan 22 16:43:49 in-target: debconf (developer): <---- 0 multiselect escape multiselect backup progresscancel align plugin-terminal plugin-detect-keyboard
Jan 22 16:43:49 in-target: debconf (developer): ----> CAPB
Jan 22 16:43:49 in-target: debconf (developer): <-- CAPB
Jan 22 16:43:49 in-target: debconf (developer): --> 0 multiselect escape multiselect backup progresscancel align plugin-terminal plugin-detect-keyboard
Jan 22 16:43:49 in-target: debconf (developer): <---- 0 multiselect escape multiselect backup progresscancel align plugin-terminal plugin-detect-keyboard
Jan 22 16:43:49 in-target: debconf (developer): --> 0 multiselect escape multiselect escape multiselect backup progresscancel align plugin-terminal plugin-detect-keyboard
Jan 22 16:43:49 in-target: Done.
DEBUG:root:Checking VM state for test case dbe8a7ba-a185-41a6-8257-0e9816126a3a
DEBUG:root:Cmd: ['virsh', 'domstate', 'dbe8a7ba-a185-41a6-8257-0e9816126a3a']
DEBUG:root:running
DEBUG:root:Capturing current d-i syslog for test case dbe8a7ba-a185-41a6-8257-0e9816126a3a
DEBUG:root:Jan 22 16:44:24 debconf: <-- 0 OK
Jan 22 16:44:24 debconf: --> PROGRESS INFO base-installer/section/cleanup
Jan 22 16:44:24 debconf: <-- 10 base-installer/section/cleanup does not exist
Jan 22 16:44:24 debconf: --> PROGRESS SET 145
Jan 22 16:44:24 debconf: <-- 0 OK
Jan 22 16:44:24 debconf: --> PROGRESS STOP
Jan 22 16:44:24 debconf: <-- 0 OK
Jan 22 16:44:24 debconf: --> GET debconf/priority
Jan 22 16:44:24 debconf: <-- 0 critical
Jan 22 16:44:24 debconf: --> X_SAVE
DEBUG:root:Checking VM state for test case dbe8a7ba-a185-41a6-8257-0e9816126a3a
DEBUG:root:Cmd: ['virsh', 'domstate', 'dbe8a7ba-a185-41a6-8257-0e9816126a3a']
DEBUG:root:running
DEBUG:root:Capturing current d-i syslog for test case dbe8a7ba-a185-41a6-8257-0e9816126a3a
DEBUG:root:Jan 22 16:44:55 in-target: debconf (developer): <-- GET debconf/priority
Jan 22 16:44:55 in-target: debconf (developer): --> 0 high
Jan 22 16:44:55 in-target: Reading package lists...
Jan 22 16:44:55 in-target: 
Jan 22 16:44:55 in-target: debconf (developer): <-- PROGRESS SET 1800
Jan 22 16:44:55 debconf: --> PROGRESS SET 1800
Jan 22 16:44:55 in-target: debconf (developer): ----> PROGRESS SET 1800
Jan 22 16:44:55 debconf: <-- 0 OK
Jan 22 16:44:55 in-target: debconf (developer): <---- 0 OK
Jan 22 16:44:55 in-target: debconf (developer): --> 0 OK
DEBUG:root:Checking VM state for test case dbe8a7ba-a185-41a6-8257-0e9816126a3a
DEBUG:root:Cmd: ['virsh', 'domstate', 'dbe8a7ba-a185-41a6-8257-0e9816126a3a']
DEBUG:root:running
DEBUG:root:Capturing current d-i syslog for test case dbe8a7ba-a185-41a6-8257-0e9816126a3a
DEBUG:root:Jan 22 16:45:17 in-target: debconf (developer): ----> DATA debconf-apt-progress/info description Retrieving file 153 of 169
Jan 22 16:45:17 debconf: --> DATA debconf-apt-progress/info description Retrieving file 153 of 169
Jan 22 16:45:17 debconf: <-- 0 OK
Jan 22 16:45:17 in-target: debconf (developer): <---- 0 OK
Jan 22 16:45:17 in-target: debconf (developer): ----> PROGRESS INFO debconf-apt-progress/info
Jan 22 16:45:17 debconf: --> PROGRESS INFO debconf-apt-progress/info
Jan 22 16:45:17 debconf: <-- 0 OK
Jan 22 16:45:17 in-target: debconf (developer): <---- 0 OK
Jan 22 16:45:17 in-target: debconf (developer): --> 0 OK
Jan 22 16:45:17 in-target: debconf (
DEBUG:root:Checking VM state for test case dbe8a7ba-a185-41a6-8257-0e9816126a3a
DEBUG:root:Cmd: ['virsh', 'domstate', 'dbe8a7ba-a185-41a6-8257-0e9816126a3a']
DEBUG:root:running
DEBUG:root:Capturing current d-i syslog for test case dbe8a7ba-a185-41a6-8257-0e9816126a3a
DEBUG:root:Jan 22 16:45:55 debconf: <-- 0 OK
Jan 22 16:45:55 in-target: debconf (developer): <---- 0 OK
Jan 22 16:45:55 in-target: debconf (developer): ----> DATA debconf-apt-progress/info description Configuring libpipeline1
Jan 22 16:45:55 debconf: --> DATA debconf-apt-progress/info description Configuring libpipeline1
Jan 22 16:45:55 debconf: <-- 0 OK
Jan 22 16:45:55 in-target: debconf (developer): <---- 0 OK
Jan 22 16:45:55 in-target: debconf (developer): ----> PROGRESS INFO debconf-apt-progress/info
Jan 22 16:45:55 debconf: --> PROGRESS INFO debconf-apt-progress/info
Jan 22 16:45:55 debconf: <-- 0 OK
Jan 22 16:45:55 in-target: debconf (developer): <---- 0 OK
DEBUG:root:Checking VM state for test case dbe8a7ba-a185-41a6-8257-0e9816126a3a
DEBUG:root:Cmd: ['virsh', 'domstate', 'dbe8a7ba-a185-41a6-8257-0e9816126a3a']
DEBUG:root:running
DEBUG:root:Capturing current d-i syslog for test case dbe8a7ba-a185-41a6-8257-0e9816126a3a
DEBUG:root:Jan 22 16:46:24 in-target: debconf (developer): <---- 0 OK
Jan 22 16:46:24 in-target: debconf (developer): ----> DATA debconf-apt-progress/info description Retrieving file 33 of 55
Jan 22 16:46:24 debconf: --> DATA debconf-apt-progress/info description Retrieving file 33 of 55
Jan 22 16:46:24 debconf: <-- 0 OK
Jan 22 16:46:24 in-target: debconf (developer): <---- 0 OK
Jan 22 16:46:24 in-target: debconf (developer): ----> PROGRESS INFO debconf-apt-progress/info
Jan 22 16:46:24 debconf: --> PROGRESS INFO debconf-apt-progress/info
Jan 22 16:46:24 debconf: <-- 0 OK
Jan 22 16:46:24 in-target: debconf (developer): <---- 0 OK
Jan 22 16:46:24 in-target: debconf (developer): --> 0 O
DEBUG:root:Checking VM state for test case dbe8a7ba-a185-41a6-8257-0e9816126a3a
DEBUG:root:Cmd: ['virsh', 'domstate', 'dbe8a7ba-a185-41a6-8257-0e9816126a3a']
DEBUG:root:running
DEBUG:root:Capturing current d-i syslog for test case dbe8a7ba-a185-41a6-8257-0e9816126a3a
DEBUG:root:Jan 22 16:46:51 in-target: done
Jan 22 16:46:51 in-target:   en_GB.UTF-8... 
Jan 22 16:46:52 in-target: done
Jan 22 16:46:52 in-target:   en_HK.UTF-8... 
Jan 22 16:46:53 in-target: done
Jan 22 16:46:53 in-target:   en_IE.UTF-8... 
Jan 22 16:46:54 in-target: done
Jan 22 16:46:54 in-target:   en_IN.UTF-8... 
Jan 22 16:46:55 in-target: done
Jan 22 16:46:55 in-target:   en_NG.UTF-8...
DEBUG:root:Checking VM state for test case dbe8a7ba-a185-41a6-8257-0e9816126a3a
DEBUG:root:Cmd: ['virsh', 'domstate', 'dbe8a7ba-a185-41a6-8257-0e9816126a3a']
DEBUG:root:running
DEBUG:root:Capturing current d-i syslog for test case dbe8a7ba-a185-41a6-8257-0e9816126a3a
DEBUG:root:Jan 22 16:47:25 in-target: debconf (developer): Trying /usr/bin/debconf-apt-progress.templates
Jan 22 16:47:25 in-target: debconf (developer): Trying /usr/share/debconf/templates/debconf-apt-progress.templates
Jan 22 16:47:25 in-target: debconf (developer): Couldn't find a templates file.
Jan 22 16:47:25 in-target: debconf (developer): frontend running, package name is 
Jan 22 16:47:25 in-target: debconf (developer): starting /usr/bin/debconf-apt-progress --no-progress --logstderr -- apt-get -q -y --no-remove install grub-common
Jan 22 16:47:26 in-target: debconf (developer): <-- GET debconf/priority
Jan 22 16:47:26 in-target: debconf (developer): --> 0 high
Jan 22 16:47:26 in-target: Reading package lists...
Jan 22 16:47:26 in-target: 
Jan 22 16:47:26 in-target: Building dependency tree...
DEBUG:root:Checking VM state for test case dbe8a7ba-a185-41a6-8257-0e9816126a3a
DEBUG:root:Cmd: ['virsh', 'domstate', 'dbe8a7ba-a185-41a6-8257-0e9816126a3a']
DEBUG:root:running
DEBUG:root:Capturing current d-i syslog for test case dbe8a7ba-a185-41a6-8257-0e9816126a3a
DEBUG:root:Jan 22 16:47:45 debconf: <-- 0 OK
Jan 22 16:47:45 finish-install: info: Running /usr/lib/finish-install.d/90console
Jan 22 16:47:45 debconf: --> GET finish-install/keep-consoles
Jan 22 16:47:45 debconf: <-- 0 false
Jan 22 16:47:45 debconf: --> PROGRESS STEP 1
Jan 22 16:47:45 debconf: <-- 0 OK
Jan 22 16:47:45 debconf: --> PROGRESS INFO finish-install/progress/save-logs
Jan 22 16:47:45 debconf: <-- 0 OK
Jan 22 16:47:45 finish-install: info: Running /usr/lib/finish-install.d/94save-logs
Jan 22 16:47:45 debconf: --> X_SAVE
DEBUG:root:Checking VM state for test case dbe8a7ba-a185-41a6-8257-0e9816126a3a
DEBUG:root:Cmd: ['virsh', 'domstate', 'dbe8a7ba-a185-41a6-8257-0e9816126a3a']
DEBUG:root:running
DEBUG:root:Capturing current d-i syslog for test case dbe8a7ba-a185-41a6-8257-0e9816126a3a
DEBUG:root:Jan 22 16:47:45 debconf: <-- 0 OK
Jan 22 16:47:45 finish-install: info: Running /usr/lib/finish-install.d/90console
Jan 22 16:47:45 debconf: --> GET finish-install/keep-consoles
Jan 22 16:47:45 debconf: <-- 0 false
Jan 22 16:47:45 debconf: --> PROGRESS STEP 1
Jan 22 16:47:45 debconf: <-- 0 OK
Jan 22 16:47:45 debconf: --> PROGRESS INFO finish-install/progress/save-logs
Jan 22 16:47:45 debconf: <-- 0 OK
Jan 22 16:47:45 finish-install: info: Running /usr/lib/finish-install.d/94save-logs
Jan 22 16:47:45 debconf: --> X_SAVE
DEBUG:root:Checking VM state for test case dbe8a7ba-a185-41a6-8257-0e9816126a3a
DEBUG:root:Cmd: ['virsh', 'domstate', 'dbe8a7ba-a185-41a6-8257-0e9816126a3a']
DEBUG:root:running
DEBUG:root:Capturing current d-i syslog for test case dbe8a7ba-a185-41a6-8257-0e9816126a3a
DEBUG:root:Jan 22 16:47:45 debconf: <-- 0 OK
Jan 22 16:47:45 finish-install: info: Running /usr/lib/finish-install.d/90console
Jan 22 16:47:45 debconf: --> GET finish-install/keep-consoles
Jan 22 16:47:45 debconf: <-- 0 false
Jan 22 16:47:45 debconf: --> PROGRESS STEP 1
Jan 22 16:47:45 debconf: <-- 0 OK
Jan 22 16:47:45 debconf: --> PROGRESS INFO finish-install/progress/save-logs
Jan 22 16:47:45 debconf: <-- 0 OK
Jan 22 16:47:45 finish-install: info: Running /usr/lib/finish-install.d/94save-logs
Jan 22 16:47:45 debconf: --> X_SAVE
DEBUG:root:Checking VM state for test case dbe8a7ba-a185-41a6-8257-0e9816126a3a
DEBUG:root:Cmd: ['virsh', 'domstate', 'dbe8a7ba-a185-41a6-8257-0e9816126a3a']
DEBUG:root:running
DEBUG:root:Capturing current d-i syslog for test case dbe8a7ba-a185-41a6-8257-0e9816126a3a
tail: cannot open '/tmp/dbe8a7ba-a185-41a6-8257-0e9816126a3a.syslog.log' for reading: Permission denied
DEBUG:root:
DEBUG:root:Checking VM state for test case dbe8a7ba-a185-41a6-8257-0e9816126a3a
DEBUG:root:Cmd: ['virsh', 'domstate', 'dbe8a7ba-a185-41a6-8257-0e9816126a3a']
DEBUG:root:shut off
DEBUG:root:VM powered off for test case dbe8a7ba-a185-41a6-8257-0e9816126a3a
DEBUG:root:test[iso_url]=/var/lib/ubuntu-iso-testing/isos/ubuntu-server/precise-server-amd64.iso
DEBUG:root:test[post-reboot-results]={'lamp-reboot': {'started': '2014-01-22T16:49:11.663151', 'script_stdout': '<testsuite errors="0" failures="0" name="" tests="1" time="0.045">\n<testcase classname="test.DefaultTest" name="test_recorded_state" time="0.038"/>\n</testsuite>\n', 'finished': '2014-01-22T16:49:11.967412', 'returncode': 0, 'script_stderr': u''}}
DEBUG:root:test[_rev]=22-0e013a1f8280b5130a321fb98d1c78ed
DEBUG:root:test[disks]=[{'bus': 'virtio', 'size': '2G', 'target': 'vda', 'format': 'qcow2'}]
DEBUG:root:test[results]={'lamp-reboot': {'started': '2014-01-22T16:48:29.762115', 'script_stdout': 'error: setUpClass (test.LampRebootTest) [\nTraceback (most recent call last):\n  File "test.py", line 37, in setUpClass\n    subprocess.check_call([\'tasksel\',\'install\',\'lamp-server\'],env=env)\n  File "/usr/lib/python2.7/subprocess.py", line 511, in check_call\n    raise CalledProcessError(retcode, cmd)\nCalledProcessError: Command \'[\'tasksel\', \'install\', \'lamp-server\']\' returned non-zero exit status 1\n]\n<testsuite errors="0" failures="0" name="" tests="0" time="4.361">\n</testsuite>\n', 'finished': '2014-01-22T16:48:34.463861', 'returncode': 0, 'script_stderr': 'tasksel: aptitude failed (100)\n'}}
DEBUG:root:test[_attachments]={'pxe/pxelinux.cfg/52:54:00:fd:b0:bc': {'stub': True, 'length': 1108, 'digest': 'md5-ueU5RFT6pkIATmoXNsdvcA==', 'revpos': 7, 'content_type': u''}, 'pxe/kernel': {'stub': True, 'length': 5908472, 'digest': 'md5-dsQygz56UZam95FeYMtUpQ==', 'revpos': 6, 'content_type': u''}, 'tests/lamp-reboot': {'stub': True, 'length': 3094, 'digest': 'md5-yg8o6cvz1/duHxbwe3Bmfw==', 'revpos': 8, 'content_type': u''}, 'post-reboot-tests/lamp-reboot': {'stub': True, 'length': 1458, 'digest': 'md5-cWfzL+xCNII6ijRKLvoI2w==', 'revpos': 9, 'content_type': u''}, 'libvirt.xml': {'stub': True, 'length': 2032, 'digest': 'md5-jxgOhq0R4blR44ZgSGFg6g==', 'revpos': 12, 'content_type': 'application/xml'}, 'preseed': {'stub': True, 'length': 13166, 'digest': 'md5-JMuWTlxjGV7/X1BzmzdWDw==', 'revpos': 2, 'content_type': u''}, 'pxe/initrd': {'stub': True, 'length': 8017791, 'digest': 'md5-VV7fLCQx+RuKbnaVc3KI0w==', 'revpos': 5, 'content_type': u''}, 'media_info': {'stub': True, 'length': 71, 'digest': 'md5-Gxsa/ZDmZgAGfFVKm3E4Nw==', 'revpos': 3, 'content_type': u''}, 'run_test': {'stub': True, 'length': 6943, 'digest': 'md5-ZbbgRpEcHSeMP9A+cvAv1Q==', 'revpos': 4, 'content_type': u''}}
DEBUG:root:test[states]={'rebooted': '2014-01-22T16:48:34.550827', 'creating': '2014-01-22T16:41:44.616271', 'created': '2014-01-22T16:41:53.886084', 'started': '2014-01-22T16:41:56.157468', 'configured': '2014-01-22T16:41:54.173971', 'testing': '2014-01-22T16:49:11.620345', 'tested': '2014-01-22T16:49:12.018397'}
DEBUG:root:test[mac]=52:54:00:fd:b0:bc
DEBUG:root:test[_id]=dbe8a7ba-a185-41a6-8257-0e9816126a3a
DEBUG:root:test[test_case]=lamp-reboot
DEBUG:root:Tests completed for test case dbe8a7ba-a185-41a6-8257-0e9816126a3a
DEBUG:root:Storing results for test lamp-reboot
DEBUG:root:Reboot tests completed for test case dbe8a7ba-a185-41a6-8257-0e9816126a3a
DEBUG:root:Storing results for test lamp-reboot
WARNING:root:Could not move syslog ([Errno 13] Permission denied: '/tmp/dbe8a7ba-a185-41a6-8257-0e9816126a3a.syslog.log')
DEBUG:root:Undefine VM for  test case dbe8a7ba-a185-41a6-8257-0e9816126a3a
DEBUG:root:Cmd: ['virsh', 'undefine', 'dbe8a7ba-a185-41a6-8257-0e9816126a3a']
Domain dbe8a7ba-a185-41a6-8257-0e9816126a3a has been undefined

DEBUG:root:Collating output for test case dbe8a7ba-a185-41a6-8257-0e9816126a3a
Archiving artifacts
Recording test results
ERROR: Failed to archive test reports
hudson.util.IOException2: remote file operation failed: <http://d-jenkins.ubuntu-ci:8080/job/precise-server-amd64_lamp-reboot/ws/> at hudson.remoting.Channel at 117f2631:wazn
	at hudson.FilePath.act(FilePath.java:848)
	at hudson.FilePath.act(FilePath.java:834)
	at hudson.tasks.junit.JUnitParser.parse(JUnitParser.java:87)
	at hudson.tasks.junit.JUnitResultArchiver.parse(JUnitResultArchiver.java:122)
	at hudson.tasks.junit.JUnitResultArchiver.perform(JUnitResultArchiver.java:134)
	at hudson.tasks.BuildStepMonitor$1.perform(BuildStepMonitor.java:19)
	at hudson.model.AbstractBuild$AbstractBuildExecution.perform(AbstractBuild.java:718)
	at hudson.model.AbstractBuild$AbstractBuildExecution.performAllBuildSteps(AbstractBuild.java:693)
	at hudson.model.Build$BuildExecution.post2(Build.java:183)
	at hudson.model.AbstractBuild$AbstractBuildExecution.post(AbstractBuild.java:640)
	at hudson.model.Run.execute(Run.java:1527)
	at hudson.model.FreeStyleBuild.run(FreeStyleBuild.java:46)
	at hudson.model.ResourceController.execute(ResourceController.java:88)
	at hudson.model.Executor.run(Executor.java:237)
Caused by: hudson.util.IOException2: Failed to read <http://d-jenkins.ubuntu-ci:8080/job/precise-server-amd64_lamp-reboot/631/artifact/631/test-results/TEST-lamp-reboot.xml>
	at hudson.tasks.junit.TestResult.parse(TestResult.java:244)
	at hudson.tasks.junit.TestResult.parse(TestResult.java:163)
	at hudson.tasks.junit.TestResult.parse(TestResult.java:140)
	at hudson.tasks.junit.TestResult.<init>(TestResult.java:116)
	at hudson.tasks.junit.JUnitParser$ParseResultCallable.invoke(JUnitParser.java:117)
	at hudson.tasks.junit.JUnitParser$ParseResultCallable.invoke(JUnitParser.java:90)
	at hudson.FilePath$FileCallableWrapper.call(FilePath.java:2246)
	at hudson.remoting.UserRequest.perform(UserRequest.java:118)
	at hudson.remoting.UserRequest.perform(UserRequest.java:48)
	at hudson.remoting.Request$2.run(Request.java:326)
	at hudson.remoting.InterceptingExecutorService$1.call(InterceptingExecutorService.java:72)
	at java.util.concurrent.FutureTask$Sync.innerRun(FutureTask.java:334)
	at java.util.concurrent.FutureTask.run(FutureTask.java:166)
	at java.util.concurrent.ThreadPoolExecutor.runWorker(ThreadPoolExecutor.java:1145)
	at java.util.concurrent.ThreadPoolExecutor$Worker.run(ThreadPoolExecutor.java:615)
	at hudson.remoting.Engine$1$1.run(Engine.java:58)
	at java.lang.Thread.run(Thread.java:724)
Caused by: org.dom4j.DocumentException: Error on line 1 of document file://<http://d-jenkins.ubuntu-ci:8080/job/precise-server-amd64_lamp-reboot/631/artifact/631/test-results/TEST-lamp-reboot.xml> : Content is not allowed in prolog. Nested exception: Content is not allowed in prolog.
	at org.dom4j.io.SAXReader.read(SAXReader.java:482)
	at org.dom4j.io.SAXReader.read(SAXReader.java:264)
	at hudson.tasks.junit.SuiteResult.parse(SuiteResult.java:116)
	at hudson.tasks.junit.TestResult.parse(TestResult.java:227)
	... 16 more
Caused by: org.xml.sax.SAXParseException; systemId: file://<http://d-jenkins.ubuntu-ci:8080/job/precise-server-amd64_lamp-reboot/631/artifact/631/test-results/TEST-lamp-reboot.xml;> lineNumber: 1; columnNumber: 1; Content is not allowed in prolog.
	at com.sun.org.apache.xerces.internal.util.ErrorHandlerWrapper.createSAXParseException(ErrorHandlerWrapper.java:198)
	at com.sun.org.apache.xerces.internal.util.ErrorHandlerWrapper.fatalError(ErrorHandlerWrapper.java:177)
	at com.sun.org.apache.xerces.internal.impl.XMLErrorReporter.reportError(XMLErrorReporter.java:441)
	at com.sun.org.apache.xerces.internal.impl.XMLErrorReporter.reportError(XMLErrorReporter.java:368)
	at com.sun.org.apache.xerces.internal.impl.XMLScanner.reportFatalError(XMLScanner.java:1388)
	at com.sun.org.apache.xerces.internal.impl.XMLDocumentScannerImpl$PrologDriver.next(XMLDocumentScannerImpl.java:998)
	at com.sun.org.apache.xerces.internal.impl.XMLDocumentScannerImpl.next(XMLDocumentScannerImpl.java:607)
	at com.sun.org.apache.xerces.internal.impl.XMLNSDocumentScannerImpl.next(XMLNSDocumentScannerImpl.java:116)
	at com.sun.org.apache.xerces.internal.impl.XMLDocumentFragmentScannerImpl.scanDocument(XMLDocumentFragmentScannerImpl.java:489)
	at com.sun.org.apache.xerces.internal.parsers.XML11Configuration.parse(XML11Configuration.java:835)
	at com.sun.org.apache.xerces.internal.parsers.XML11Configuration.parse(XML11Configuration.java:764)
	at com.sun.org.apache.xerces.internal.parsers.XMLParser.parse(XMLParser.java:123)
	at com.sun.org.apache.xerces.internal.parsers.AbstractSAXParser.parse(AbstractSAXParser.java:1210)
	at com.sun.org.apache.xerces.internal.jaxp.SAXParserImpl$JAXPSAXParser.parse(SAXParserImpl.java:568)
	at org.dom4j.io.SAXReader.read(SAXReader.java:465)
	... 19 more
Build step 'Publish JUnit test result report' changed build result to FAILURE
Description set: 20140122



More information about the ubuntu-testing-notifications mailing list