Build failed in Jenkins: precise-upgrade-lucid-server » i386,lts,server,upgrade-test #674

Jenkins Notification devnull at canonical.com
Sun Dec 1 17:09:30 UTC 2013


See <http://d-jenkins.ubuntu-ci:8080/job/precise-upgrade-lucid-server/./ARCH=i386,LTS=lts,PROFILE=server,label=upgrade-test/674/>

------------------------------------------
Started by upstream project "precise-upgrade-lucid-server" build number 674
[EnvInject] - Loading node environment variables.
Building remotely on alderamin-upgrade in workspace <http://d-jenkins.ubuntu-ci:8080/job/precise-upgrade-lucid-server/./ARCH=i386,LTS=lts,PROFILE=server,label=upgrade-test/ws/>
No emails were triggered.
[upgrade-test] $ /bin/sh -x /tmp/hudson1825995977959873687.sh
+ rm -Rf auto-upgrade-testing results
+ BRANCH=auto-upgrade-testing
+ [ -d auto-upgrade-testing ]
+ bzr branch lp:auto-upgrade-testing
You have not informed bzr of your Launchpad ID, and you must do this to
write to Launchpad or access private data.  See "bzr help launchpad-login".
Branched 74 revisions.
+ cd auto-upgrade-testing
+ LTSPREFIX=
+ ARCHEXT=
+ BASEDIR=/home/upgrade-tester/auto-upgrade-tester
+ [ lts = non-lts ]
+ LTSPREFIX=lts-
+ ARCHEXT=i386
+ PROFILENAME=lts-server-i386
+ [ i386 = i386 ]
+ [ ! -e /home/upgrade-tester/auto-upgrade-tester/profiles/lts-server-i386 ]
+ PROFILENAME=lts-server
+ echo Running profile lts-server
Running profile lts-server
+ python bin/auto-upgrade-tester /home/upgrade-tester/auto-upgrade-tester/profiles/lts-server
Testing '/home/upgrade-tester/auto-upgrade-tester/profiles/lts-server'
using ssh port: 54322
using VncNum: 5901
Storing the result in '/home/upgrade-tester/auto-upgrade-tester/result/lts-server'
2013-12-01 17:08:13.866861 log started
bootstrap()
Not bootstrapping again, we have a cached BaseImage
upgrade()
Starting for upgrade
Starting ['kvm', '-hda', '/home/upgrade-tester/auto-upgrade-tester/test-image.lts-server', '-monitor', 'stdio', '-localtime', '-no-reboot', '-net', 'nic,model=virtio', '-net', 'user', '-redir', 'tcp:54322::22', '-vnc', 'localhost:1', '-m', '1536']
Copying '/home/upgrade-tester/auto-upgrade-tester/profiles/lts-server/DistUpgrade.cfg' to image overrides
Copying '/home/upgrade-tester/auto-upgrade-tester/profiles/override.cfg.d/global.cfg' to image overrides
Disabling ForceOverwrite
Using do-release-upgrade for the upgrade
dist-upgrade.py returned: 1
coyping the result
Shuting down the VM
stop
stop pid:  <subprocess.Popen object at 0x2267690>
waiting for qemu to shutdown
poll() returned
qemu stopped
FAILED: upgrade for '/home/upgrade-tester/auto-upgrade-tester/profiles/lts-server'
Failed to upgrade /home/upgrade-tester/auto-upgrade-tester/profiles/lts-server
Logs can be found here:
 /home/upgrade-tester/auto-upgrade-tester/result/lts-server/bootstrap.log
 /home/upgrade-tester/auto-upgrade-tester/result/lts-server/main.log
 /home/upgrade-tester/auto-upgrade-tester/result/lts-server/apt.log
2013-12-01 17:09:28.278841 log ended.
Duration: 0:01:14.411980
Profile '/home/upgrade-tester/auto-upgrade-tester/profiles/lts-server' FAILED
stop
Releasing lock: /var/lock/auto-upgrade-tester.54322.lock
Releasing lock: /var/lock/auto-upgrade-tester.5901.lock
+ cp -ar /home/upgrade-tester/auto-upgrade-tester/result/lts-server/ <http://d-jenkins.ubuntu-ci:8080/job/precise-upgrade-lucid-server/./ARCH=i386,LTS=lts,PROFILE=server,label=upgrade-test/ws/results>
Archiving artifacts
Recording test results
No test report files were found. Configuration error?
Build step 'Publish JUnit test result report' changed build result to FAILURE



More information about the ubuntu-testing-notifications mailing list