Build failed in Jenkins: precise-upgrade-lucid-server » amd64,lts,server,upgrade-test #665

Jenkins Notification devnull at canonical.com
Thu Nov 7 22:37:58 UTC 2013


See <http://10.189.74.2:8080/job/precise-upgrade-lucid-server/./ARCH=amd64,LTS=lts,PROFILE=server,label=upgrade-test/665/>

------------------------------------------
Started by upstream project "precise-upgrade-lucid-server" build number 665
[EnvInject] - Loading node environment variables.
Building remotely on alderamin-upgrade
No emails were triggered.
[upgrade-test] $ /bin/sh -x /tmp/hudson8078165513328326122.sh
+ rm -Rf auto-upgrade-testing results
+ BRANCH=auto-upgrade-testing
+ [ -d auto-upgrade-testing ]
+ bzr branch lp:auto-upgrade-testing
You have not informed bzr of your Launchpad ID, and you must do this to
write to Launchpad or access private data.  See "bzr help launchpad-login".
Branched 74 revisions.
+ cd auto-upgrade-testing
+ LTSPREFIX=
+ ARCHEXT=
+ BASEDIR=/home/upgrade-tester/auto-upgrade-tester
+ [ lts = non-lts ]
+ LTSPREFIX=lts-
+ ARCHEXT=amd64
+ PROFILENAME=lts-server-amd64
+ [ amd64 = i386 ]
+ echo Running profile lts-server-amd64
Running profile lts-server-amd64
+ python bin/auto-upgrade-tester /home/upgrade-tester/auto-upgrade-tester/profiles/lts-server-amd64
Testing '/home/upgrade-tester/auto-upgrade-tester/profiles/lts-server-amd64'
using ssh port: 54322
using VncNum: 5901
Storing the result in '/home/upgrade-tester/auto-upgrade-tester/result/lts-server-amd64'
2013-11-07 22:07:44.548612 log started
bootstrap()
Not bootstrapping again, we have a cached BaseImage
upgrade()
Starting for upgrade
Starting ['kvm', '-hda', '/home/upgrade-tester/auto-upgrade-tester/test-image.lts-server-amd64', '-monitor', 'stdio', '-localtime', '-no-reboot', '-net', 'nic,model=virtio', '-net', 'user', '-redir', 'tcp:54322::22', '-vnc', 'localhost:1', '-m', '1536']
Could not start image after 900s, exiting
FAILED: upgrade for '/home/upgrade-tester/auto-upgrade-tester/profiles/lts-server-amd64'
Failed to upgrade /home/upgrade-tester/auto-upgrade-tester/profiles/lts-server-amd64
Logs can be found here:
 /home/upgrade-tester/auto-upgrade-tester/result/lts-server-amd64/bootstrap.log
 /home/upgrade-tester/auto-upgrade-tester/result/lts-server-amd64/main.log
 /home/upgrade-tester/auto-upgrade-tester/result/lts-server-amd64/apt.log
2013-11-07 22:25:16.041606 log ended.
Duration: 0:17:31.492994
Profile '/home/upgrade-tester/auto-upgrade-tester/profiles/lts-server-amd64' FAILED
stop
stop pid:  <subprocess.Popen object at 0x164b710>
waiting for qemu to shutdown
Not stopped after 600s, killing 
qemu stopped
Releasing lock: /var/lock/auto-upgrade-tester.54322.lock
Releasing lock: /var/lock/auto-upgrade-tester.5901.lock
+ cp -ar /home/upgrade-tester/auto-upgrade-tester/result/lts-server-amd64/ <http://10.189.74.2:8080/job/precise-upgrade-lucid-server/./ARCH=amd64,LTS=lts,PROFILE=server,label=upgrade-test/ws/results>
Archiving artifacts
Recording test results
No test report files were found. Configuration error?
Build step 'Publish JUnit test result report' changed build result to FAILURE



More information about the ubuntu-testing-notifications mailing list