Build failed in Jenkins: precise-upgrade-lucid-main » i386,lts,main-all,upgrade-test #594

Jenkins Notification devnull at canonical.com
Wed Sep 25 16:26:20 UTC 2013


See <http://10.189.74.2:8080/job/precise-upgrade-lucid-main/./ARCH=i386,LTS=lts,PROFILE=main-all,label=upgrade-test/594/>

------------------------------------------
Started by upstream project "precise-upgrade-lucid-main" build number 594
[EnvInject] - Loading node environment variables.
Building remotely on alderamin-upgrade
No emails were triggered.
[upgrade-test] $ /bin/sh -x /tmp/hudson6606441774068199512.sh
+ rm -Rf auto-upgrade-testing results
+ BRANCH=auto-upgrade-testing
+ [ -d auto-upgrade-testing ]
+ bzr branch lp:auto-upgrade-testing
You have not informed bzr of your Launchpad ID, and you must do this to
write to Launchpad or access private data.  See "bzr help launchpad-login".
Branched 74 revisions.
+ cd auto-upgrade-testing
+ LTSPREFIX=
+ ARCHEXT=
+ BASEDIR=/home/upgrade-tester/auto-upgrade-tester
+ [ lts = non-lts ]
+ LTSPREFIX=lts-
+ ARCHEXT=i386
+ PROFILENAME=lts-main-all-i386
+ [ i386 = i386 ]
+ [ ! -e /home/upgrade-tester/auto-upgrade-tester/profiles/lts-main-all-i386 ]
+ PROFILENAME=lts-main-all
+ echo Running profile lts-main-all
Running profile lts-main-all
+ python bin/auto-upgrade-tester /home/upgrade-tester/auto-upgrade-tester/profiles/lts-main-all
Testing '/home/upgrade-tester/auto-upgrade-tester/profiles/lts-main-all'
Port 54322 already locked. Skipping!
Port 54323 already in use. Skipping!
using ssh port: 54324
Port 5901 already in use. Skipping!
Port 5902 already in use. Skipping!
Port 5903 already locked. Skipping!
using VncNum: 5904
Storing the result in '/home/upgrade-tester/auto-upgrade-tester/result/lts-main-all'
2013-09-25 12:08:03.415613 log started
bootstrap()
Not bootstrapping again, we have a cached BaseImage
upgrade()
Starting for upgrade
Starting ['kvm', '-hda', '/home/upgrade-tester/auto-upgrade-tester/test-image.lts-main-all', '-monitor', 'stdio', '-localtime', '-no-reboot', '-net', 'nic,model=virtio', '-net', 'user', '-redir', 'tcp:54324::22', '-vnc', 'localhost:4', '-m', '3072']
qemu stopped unexpectedly with exit code '1'
FAILED: upgrade for '/home/upgrade-tester/auto-upgrade-tester/profiles/lts-main-all'
Failed to upgrade /home/upgrade-tester/auto-upgrade-tester/profiles/lts-main-all
Logs can be found here:
 /home/upgrade-tester/auto-upgrade-tester/result/lts-main-all/bootstrap.log
 /home/upgrade-tester/auto-upgrade-tester/result/lts-main-all/main.log
 /home/upgrade-tester/auto-upgrade-tester/result/lts-main-all/apt.log
2013-09-25 12:26:17.299912 log ended.
Duration: 0:18:13.884299
Profile '/home/upgrade-tester/auto-upgrade-tester/profiles/lts-main-all' FAILED
stop
stop pid:  <subprocess.Popen object at 0x16b9750>
waiting for qemu to shutdown
poll() returned
qemu stopped
Releasing lock: /var/lock/auto-upgrade-tester.54324.lock
Releasing lock: /var/lock/auto-upgrade-tester.5904.lock
+ cp -ar /home/upgrade-tester/auto-upgrade-tester/result/lts-main-all/ <http://10.189.74.2:8080/job/precise-upgrade-lucid-main/./ARCH=i386,LTS=lts,PROFILE=main-all,label=upgrade-test/ws/results>
Archiving artifacts
Recording test results
No test report files were found. Configuration error?
Build step 'Publish JUnit test result report' changed build result to FAILURE



More information about the ubuntu-testing-notifications mailing list