Build failed in Jenkins: saucy-upgrade-raring-server » amd64,non-lts,server-tasks,upgrade-test #95

Jenkins Notification devnull at canonical.com
Mon Sep 23 23:10:37 UTC 2013


See <http://10.189.74.2:8080/job/saucy-upgrade-raring-server/./ARCH=amd64,LTS=non-lts,PROFILE=server-tasks,label=upgrade-test/95/>

------------------------------------------
Started by upstream project "saucy-upgrade-raring-server" build number 95
[EnvInject] - Loading node environment variables.
Building remotely on wazn-upgrade
[upgrade-test] $ /bin/sh -x /tmp/hudson1322494019217141903.sh
+ rm -Rf auto-upgrade-testing results
+ BRANCH=auto-upgrade-testing
+ distro-info -d
+ RELEASE=saucy
+ [ -d auto-upgrade-testing ]
+ bzr branch lp:auto-upgrade-testing
You have not informed bzr of your Launchpad ID, and you must do this to
write to Launchpad or access private data.  See "bzr help launchpad-login".
Branched 74 revisions.
+ cd auto-upgrade-testing
+ LTSPREFIX=
+ ARCHEXT=
+ BASEDIR=/home/upgrade-tester/auto-upgrade-tester
+ [ non-lts = non-lts ]
+ LTSPREFIX=
+ ARCHEXT=amd64
+ PROFILENAME=saucy-server-tasks-amd64
+ echo Running profile saucy-server-tasks-amd64
Running profile saucy-server-tasks-amd64
+ PYTHONCMD=
+ python -c import DistUpgrade
+ bin/auto-upgrade-tester /home/upgrade-tester/auto-upgrade-tester/profiles/saucy-server-tasks-amd64
Testing '/home/upgrade-tester/auto-upgrade-tester/profiles/saucy-server-tasks-amd64'
using ssh port: 54322
using VncNum: 5901
Storing the result in '/home/upgrade-tester/auto-upgrade-tester/result/saucy-server-tasks-amd64'
2013-09-23 23:03:44.892694 log started
bootstrap()
Not bootstrapping again, we have a cached BaseImage
upgrade()
Starting for upgrade
Starting ['kvm', '-hda', '/home/upgrade-tester//auto-upgrade-tester/test-image.saucy-server-tasks-amd64', '-monitor', 'stdio', '-localtime', '-no-reboot', '-net', 'nic,model=virtio', '-net', 'user', '-redir', 'tcp:54322::22', '-vnc', 'localhost:1', '-m', '1536']
W: kvm binary is deprecated, please use qemu-system-x86_64 instead
QEMU 1.4.0 monitor - type 'help' for more information
(qemu) Copying '/home/upgrade-tester/auto-upgrade-tester/profiles/saucy-server-tasks-amd64/DistUpgrade.cfg' to image overrides
Copying '/home/upgrade-tester/auto-upgrade-tester/profiles/override.cfg.d/global.cfg' to image overrides
Disabling ForceOverwrite
Using do-release-upgrade for the upgrade
Checking for a new Ubuntu release

0% [Working]
0% [Working]
0% [Working]
0% [Working]
Get:1 Upgrade tool signature [198 B]

0%
99% [Working]
99% [Working]
Get:2 Upgrade tool [1,135 kB]

0%
100% [Working]
Fetched 1,135 kB in 0s (0 B/s)
authenticate 'saucy.tar.gz' against 'saucy.tar.gz.gpg' 
extracting 'saucy.tar.gz'
dist-upgrade.py returned: 1
coyping the result
Shuting down the VM
stop
stop pid:  <subprocess.Popen object at 0x7fdbe129b9d0>
waiting for qemu to shutdown
poll() returned
qemu stopped
FAILED: upgrade for '/home/upgrade-tester/auto-upgrade-tester/profiles/saucy-server-tasks-amd64'
Failed to upgrade /home/upgrade-tester/auto-upgrade-tester/profiles/saucy-server-tasks-amd64
Logs can be found here:
 /home/upgrade-tester/auto-upgrade-tester/result/saucy-server-tasks-amd64/bootstrap.log
 /home/upgrade-tester/auto-upgrade-tester/result/saucy-server-tasks-amd64/main.log
 /home/upgrade-tester/auto-upgrade-tester/result/saucy-server-tasks-amd64/apt.log
2013-09-23 23:06:11.500448 log ended.
Duration: 0:02:26.607754
Profile '/home/upgrade-tester/auto-upgrade-tester/profiles/saucy-server-tasks-amd64' FAILED
stop
Releasing lock: /var/lock/auto-upgrade-tester.54322.lock
Releasing lock: /var/lock/auto-upgrade-tester.5901.lock
+ cp -ar /home/upgrade-tester/auto-upgrade-tester/result/saucy-server-tasks-amd64/ <http://10.189.74.2:8080/job/saucy-upgrade-raring-server/./ARCH=amd64,LTS=non-lts,PROFILE=server-tasks,label=upgrade-test/ws/results>
Archiving artifacts
Recording test results
No test report files were found. Configuration error?
Build step 'Publish JUnit test result report' changed build result to FAILURE



More information about the ubuntu-testing-notifications mailing list