Build failed in Jenkins: raring-ppa-adt-ubuntu_mozilla_daily_ppa-firefox-trunk » i386,adt #407

Jenkins Notification devnull at canonical.com
Mon Sep 23 08:31:13 UTC 2013


See <http://10.189.74.2:8080/job/raring-ppa-adt-ubuntu_mozilla_daily_ppa-firefox-trunk/./ARCH=i386,label=adt/407/>

------------------------------------------
[...truncated 190078 lines...]
Removing expected failure from reftest.layout.reftests.text.auto-hyphenation-is-1.html (Needs hyphenation patterns)
Removing expected failure from reftest.layout.reftests.text.auto-hyphenation-it-1.html (Needs hyphenation patterns)
Removing expected failure from reftest.layout.reftests.text.auto-hyphenation-kmr-1.html (Needs hyphenation patterns)
Removing expected failure from reftest.layout.reftests.text.auto-hyphenation-la-1.html (Needs hyphenation patterns)
Removing expected failure from reftest.layout.reftests.text.auto-hyphenation-lt-1.html (Needs hyphenation patterns)
Removing expected failure from reftest.layout.reftests.text.auto-hyphenation-mn-1.html (Needs hyphenation patterns)
Removing expected failure from reftest.layout.reftests.text.auto-hyphenation-nb-1.html (Needs hyphenation patterns)
Removing expected failure from reftest.layout.reftests.text.auto-hyphenation-nl-1.html (Needs hyphenation patterns)
Removing expected failure from reftest.layout.reftests.text.auto-hyphenation-nn-1.html (Needs hyphenation patterns)
Removing expected failure from reftest.layout.reftests.text.auto-hyphenation-pt-1.html (Needs hyphenation patterns)
Removing expected failure from reftest.layout.reftests.text.auto-hyphenation-ru-1.html (Needs hyphenation patterns)
Removing expected failure from reftest.layout.reftests.text.auto-hyphenation-sh-1.html (Needs hyphenation patterns)
Removing expected failure from reftest.layout.reftests.text.auto-hyphenation-sl-1.html (Needs hyphenation patterns)
Removing expected failure from reftest.layout.reftests.text.auto-hyphenation-sr-1.html (Needs hyphenation patterns)
Removing expected failure from reftest.layout.reftests.text.auto-hyphenation-sv-1.html (Needs hyphenation patterns)
Removing expected failure from reftest.layout.reftests.text.auto-hyphenation-sv-1.html (Needs hyphenation patterns)
Removing expected failure from reftest.layout.reftests.text.auto-hyphenation-tr-1.html (Needs hyphenation patterns)
Removing expected failure from reftest.layout.reftests.text.auto-hyphenation-uk-1.html (Needs hyphenation patterns)
Removing expected failure from reftest.layout.reftests.transform-3d.scale3d-all.html (subpixel AA?)
Removing expected failure from reftest.layout.reftests.transform-3d.scale3d-all-separate.html (subpixel AA?)
Removing expected failure from reftest.layout.reftests.xul.accesskey.xul
Removing expected failure from reftest.editor.reftests.spellcheck-hyphen-valid.html (https://launchpad.net/bugs/1159073)
Adjusting failure count from 91 to 1
Finished processing file /var/tmp/testresults/reftest.xml
Processing file /var/tmp/testresults/crashtest.xml
Testsuite name crashtest
Finished processing file /var/tmp/testresults/crashtest.xml
Processing file /var/tmp/testresults/xpcshell-package-tests.xml
Testsuite name xpcshell.package
Finished processing file /var/tmp/testresults/xpcshell-package-tests.xml
adt-run: trace: & dsc0t-post-process: ----------------------------------------]
adt-run: trace1: ** needs_reset, previously=False
adt-run: trace: @@@@@@@@@@@@@@@@@@@@@@@@@@@@@@@@@@@@@@@@ tests done.
adt-run: trace: ** stop
adt-run: trace: ** close, scratch=tb-scratch~/tmp/tmp.TWbjcE3CNh:-/|/tmp/tmp.TWbjcE3CNh/!
+ RC=4
+ [ 4 -eq 20 ]
+ [ 0 -eq 1 ]
+ [ -x /home/ubuntu/adt-export-result ]
+ RES=PASS
+ [ 4 -gt 0 ]
+ RES=FAIL
+ /home/ubuntu/adt-export-result -D /home/ubuntu/adt-log firefox-trunk FAIL
+ chown -R ubuntu /home/ubuntu/adt-log /var/tmp/testresults
+ chmod og+r /var/log/syslog
+ ls /var/crash/
+ [ -n _usr_lib_firefox-trunk_xpcshell.1000.crash ]
+ check_installed apport
+ dpkg-query -W -f ${Status} apport
+ grep -qw ^install
+ + cut -d  -f1
lsb_release -sc
+ sha512sum
+ arch
+ echo ubuntu_autopkgtest_raring_i686
+ export CRASH_DB_IDENTIFIER=3296ce4ffba8d9271575f35b079531756ed303a9741c9e3121f6b26cd1973c0363653d752ac9cea61352737b8a29c5a77f1e03f10b1a215c97fad239a66ba1ca
+ [ -x /usr/share/apport/whoopsie-upload-all ]
+ chmod og+r /var/crash/_usr_lib_firefox-trunk_xpcshell.1000.crash
+ exit 4
Connection to localhost closed.
+ RET=4
+ [ 0 -eq 1 ]
+ [ 4 -gt 0 ]
+ log_failure_msg adt-run exited with status 4.
+ log_msg Failure: adt-run exited with status 4.\n
+ date +%F %X
+ printf 2013-09-23 04:31:00 AM: Failure: adt-run exited with status 4.\n
2013-09-23 04:31:00 AM: Failure: adt-run exited with status 4.
+ [ 0 -eq 0 ]
+ mkdir -p <http://10.189.74.2:8080/job/raring-ppa-adt-ubuntu_mozilla_daily_ppa-firefox-trunk/./ARCH=i386,label=adt/ws/results>
+ ssh -o UserKnownHostsFile=/dev/null -o StrictHostKeyChecking=no -o CheckHostIP=no -i /home/auto-package-testing/cache/disks/adtkey -p 54323 -tt -o BatchMode=yes -l ubuntu localhost sudo chown -R ubuntu /home/ubuntu/adt-log; find /home/ubuntu/adt-log -type f -empty | xargs rm
Warning: Permanently added '[localhost]:54323' (ECDSA) to the list of known hosts.
Connection to localhost closed.
+ scp -r -o UserKnownHostsFile=/dev/null -o StrictHostKeyChecking=no -o CheckHostIP=no -i /home/auto-package-testing/cache/disks/adtkey -P 54323 ubuntu at localhost:/home/ubuntu/adt-log/* /var/crash/*crash /var/log/syslog /var/tmp/testresults <http://10.189.74.2:8080/job/raring-ppa-adt-ubuntu_mozilla_daily_ppa-firefox-trunk/./ARCH=i386,label=adt/ws/results>
+ log_info_msg Test artifacts copied to <http://10.189.74.2:8080/job/raring-ppa-adt-ubuntu_mozilla_daily_ppa-firefox-trunk/./ARCH=i386,label=adt/ws/results>
+ log_msg Info: Test artifacts copied to <http://10.189.74.2:8080/job/raring-ppa-adt-ubuntu_mozilla_daily_ppa-firefox-trunk/./ARCH=i386,label=adt/ws/results\n>
+ date +%F %X
+ printf 2013-09-23 04:31:08 AM: Info: Test artifacts copied to <http://10.189.74.2:8080/job/raring-ppa-adt-ubuntu_mozilla_daily_ppa-firefox-trunk/./ARCH=i386,label=adt/ws/results\n>
2013-09-23 04:31:08 AM: Info: Test artifacts copied to <http://10.189.74.2:8080/job/raring-ppa-adt-ubuntu_mozilla_daily_ppa-firefox-trunk/./ARCH=i386,label=adt/ws/results>
+ [ -f <http://10.189.74.2:8080/job/raring-ppa-adt-ubuntu_mozilla_daily_ppa-firefox-trunk/./ARCH=i386,label=adt/407/artifact/results/summary.log> ]
+ mkdir -p <http://10.189.74.2:8080/job/raring-ppa-adt-ubuntu_mozilla_daily_ppa-firefox-trunk/./ARCH=i386,label=adt/ws/results/testresults/>
+ summary2xml <http://10.189.74.2:8080/job/raring-ppa-adt-ubuntu_mozilla_daily_ppa-firefox-trunk/./ARCH=i386,label=adt/407/artifact/results/summary.log>
+ [ ! -f <http://10.189.74.2:8080/job/raring-ppa-adt-ubuntu_mozilla_daily_ppa-firefox-trunk/./ARCH=i386,label=adt/407/artifact/results/summary.log> ]
+ classname=summary
+ tc=
+ fails=0
+ tests=0
+ read t r e
+ + sed -e s~&~\&~g -e s~<~\<~g -e s~>~\>~g -e s~"~\"~g
echo
+ e=
+ [ PASS = FAIL ]
+ tc=\n\t<testcase classname='summary' name='dsc0t-xpcshell-tests' time='0.01'/>
+ tests=1
+ read t r e
+ echo
+ sed -e s~&~\&~g -e s~<~\<~g -e s~>~\>~g -e s~"~\"~g
+ e=
+ [ PASS = FAIL ]
+ tc=\n\t<testcase classname='summary' name='dsc0t-xpcshell-tests' time='0.01'/>\n\t<testcase classname='summary' name='dsc0t-xpcshell-package-tests' time='0.01'/>
+ tests=2
+ read t r e
+ echo
+ sed -e s~&~\&~g -e s~<~\<~g -e s~>~\>~g -e s~"~\"~g
+ e=
+ [ PASS = FAIL ]
+ tc=\n\t<testcase classname='summary' name='dsc0t-xpcshell-tests' time='0.01'/>\n\t<testcase classname='summary' name='dsc0t-xpcshell-package-tests' time='0.01'/>\n\t<testcase classname='summary' name='dsc0t-jstestbrowser' time='0.01'/>
+ tests=3
+ read t r e
+ + echo
sed -e s~&~\&~g -e s~<~\<~g -e s~>~\>~g -e s~"~\"~g
+ e=
+ [ PASS = FAIL ]
+ tc=\n\t<testcase classname='summary' name='dsc0t-xpcshell-tests' time='0.01'/>\n\t<testcase classname='summary' name='dsc0t-xpcshell-package-tests' time='0.01'/>\n\t<testcase classname='summary' name='dsc0t-jstestbrowser' time='0.01'/>\n\t<testcase classname='summary' name='dsc0t-reftest' time='0.01'/>
+ tests=4
+ read t r e
+ echo
+ sed -e s~&~\&~g -e s~<~\<~g -e s~>~\>~g -e s~"~\"~g
+ e=
+ [ PASS = FAIL ]
+ tc=\n\t<testcase classname='summary' name='dsc0t-xpcshell-tests' time='0.01'/>\n\t<testcase classname='summary' name='dsc0t-xpcshell-package-tests' time='0.01'/>\n\t<testcase classname='summary' name='dsc0t-jstestbrowser' time='0.01'/>\n\t<testcase classname='summary' name='dsc0t-reftest' time='0.01'/>\n\t<testcase classname='summary' name='dsc0t-crashtest' time='0.01'/>
+ tests=5
+ read t r e
+ echo status: 1, stderr: Traceback (most recent call last):
+ sed -e s~&~\&~g -e s~<~\<~g -e s~>~\>~g -e s~"~\"~g
+ e=status: 1, stderr: Traceback (most recent call last):
+ [ FAIL = FAIL ]
+ fails=1
+ tc=\n\t<testcase classname='summary' name='dsc0t-xpcshell-tests' time='0.01'/>\n\t<testcase classname='summary' name='dsc0t-xpcshell-package-tests' time='0.01'/>\n\t<testcase classname='summary' name='dsc0t-jstestbrowser' time='0.01'/>\n\t<testcase classname='summary' name='dsc0t-reftest' time='0.01'/>\n\t<testcase classname='summary' name='dsc0t-crashtest' time='0.01'/>\n\t<testcase classname='summary' name='dsc0t-mochitest-1' time='0.01'>
+ tc=\n\t<testcase classname='summary' name='dsc0t-xpcshell-tests' time='0.01'/>\n\t<testcase classname='summary' name='dsc0t-xpcshell-package-tests' time='0.01'/>\n\t<testcase classname='summary' name='dsc0t-jstestbrowser' time='0.01'/>\n\t<testcase classname='summary' name='dsc0t-reftest' time='0.01'/>\n\t<testcase classname='summary' name='dsc0t-crashtest' time='0.01'/>\n\t<testcase classname='summary' name='dsc0t-mochitest-1' time='0.01'>\n\t\t<failure message='' type=''>status: 1, stderr: Traceback (most recent call last):</failure>\n\t</testcase>
+ tests=6
+ read t r e
+ echo status: 1, stderr: Traceback (most recent call last):
+ sed -e s~&~\&~g -e s~<~\<~g -e s~>~\>~g -e s~"~\"~g
+ e=status: 1, stderr: Traceback (most recent call last):
+ [ FAIL = FAIL ]
+ fails=2
+ tc=\n\t<testcase classname='summary' name='dsc0t-xpcshell-tests' time='0.01'/>\n\t<testcase classname='summary' name='dsc0t-xpcshell-package-tests' time='0.01'/>\n\t<testcase classname='summary' name='dsc0t-jstestbrowser' time='0.01'/>\n\t<testcase classname='summary' name='dsc0t-reftest' time='0.01'/>\n\t<testcase classname='summary' name='dsc0t-crashtest' time='0.01'/>\n\t<testcase classname='summary' name='dsc0t-mochitest-1' time='0.01'>\n\t\t<failure message='' type=''>status: 1, stderr: Traceback (most recent call last):</failure>\n\t</testcase>\n\t<testcase classname='summary' name='dsc0t-mochitest-2' time='0.01'>
+ tc=\n\t<testcase classname='summary' name='dsc0t-xpcshell-tests' time='0.01'/>\n\t<testcase classname='summary' name='dsc0t-xpcshell-package-tests' time='0.01'/>\n\t<testcase classname='summary' name='dsc0t-jstestbrowser' time='0.01'/>\n\t<testcase classname='summary' name='dsc0t-reftest' time='0.01'/>\n\t<testcase classname='summary' name='dsc0t-crashtest' time='0.01'/>\n\t<testcase classname='summary' name='dsc0t-mochitest-1' time='0.01'>\n\t\t<failure message='' type=''>status: 1, stderr: Traceback (most recent call last):</failure>\n\t</testcase>\n\t<testcase classname='summary' name='dsc0t-mochitest-2' time='0.01'>\n\t\t<failure message='' type=''>status: 1, stderr: Traceback (most recent call last):</failure>\n\t</testcase>
+ tests=7
+ read t r e
+ echo status: 1, stderr: Traceback (most recent call last):
+ sed -e s~&~\&~g -e s~<~\<~g -e s~>~\>~g -e s~"~\"~g
+ e=status: 1, stderr: Traceback (most recent call last):
+ [ FAIL = FAIL ]
+ fails=3
+ tc=\n\t<testcase classname='summary' name='dsc0t-xpcshell-tests' time='0.01'/>\n\t<testcase classname='summary' name='dsc0t-xpcshell-package-tests' time='0.01'/>\n\t<testcase classname='summary' name='dsc0t-jstestbrowser' time='0.01'/>\n\t<testcase classname='summary' name='dsc0t-reftest' time='0.01'/>\n\t<testcase classname='summary' name='dsc0t-crashtest' time='0.01'/>\n\t<testcase classname='summary' name='dsc0t-mochitest-1' time='0.01'>\n\t\t<failure message='' type=''>status: 1, stderr: Traceback (most recent call last):</failure>\n\t</testcase>\n\t<testcase classname='summary' name='dsc0t-mochitest-2' time='0.01'>\n\t\t<failure message='' type=''>status: 1, stderr: Traceback (most recent call last):</failure>\n\t</testcase>\n\t<testcase classname='summary' name='dsc0t-mochitest-3' time='0.01'>
+ tc=\n\t<testcase classname='summary' name='dsc0t-xpcshell-tests' time='0.01'/>\n\t<testcase classname='summary' name='dsc0t-xpcshell-package-tests' time='0.01'/>\n\t<testcase classname='summary' name='dsc0t-jstestbrowser' time='0.01'/>\n\t<testcase classname='summary' name='dsc0t-reftest' time='0.01'/>\n\t<testcase classname='summary' name='dsc0t-crashtest' time='0.01'/>\n\t<testcase classname='summary' name='dsc0t-mochitest-1' time='0.01'>\n\t\t<failure message='' type=''>status: 1, stderr: Traceback (most recent call last):</failure>\n\t</testcase>\n\t<testcase classname='summary' name='dsc0t-mochitest-2' time='0.01'>\n\t\t<failure message='' type=''>status: 1, stderr: Traceback (most recent call last):</failure>\n\t</testcase>\n\t<testcase classname='summary' name='dsc0t-mochitest-3' time='0.01'>\n\t\t<failure message='' type=''>status: 1, stderr: Traceback (most recent call last):</failure>\n\t</testcase>
+ tests=8
+ read t r e
+ + echo status: 1, stderr: Traceback (most recent call last):
sed -e s~&~\&~g -e s~<~\<~g -e s~>~\>~g -e s~"~\"~g
+ e=status: 1, stderr: Traceback (most recent call last):
+ [ FAIL = FAIL ]
+ fails=4
+ tc=\n\t<testcase classname='summary' name='dsc0t-xpcshell-tests' time='0.01'/>\n\t<testcase classname='summary' name='dsc0t-xpcshell-package-tests' time='0.01'/>\n\t<testcase classname='summary' name='dsc0t-jstestbrowser' time='0.01'/>\n\t<testcase classname='summary' name='dsc0t-reftest' time='0.01'/>\n\t<testcase classname='summary' name='dsc0t-crashtest' time='0.01'/>\n\t<testcase classname='summary' name='dsc0t-mochitest-1' time='0.01'>\n\t\t<failure message='' type=''>status: 1, stderr: Traceback (most recent call last):</failure>\n\t</testcase>\n\t<testcase classname='summary' name='dsc0t-mochitest-2' time='0.01'>\n\t\t<failure message='' type=''>status: 1, stderr: Traceback (most recent call last):</failure>\n\t</testcase>\n\t<testcase classname='summary' name='dsc0t-mochitest-3' time='0.01'>\n\t\t<failure message='' type=''>status: 1, stderr: Traceback (most recent call last):</failure>\n\t</testcase>\n\t<testcase classname='summary' name='dsc0t-mochitest-4' time='0.01'>
+ tc=\n\t<testcase classname='summary' name='dsc0t-xpcshell-tests' time='0.01'/>\n\t<testcase classname='summary' name='dsc0t-xpcshell-package-tests' time='0.01'/>\n\t<testcase classname='summary' name='dsc0t-jstestbrowser' time='0.01'/>\n\t<testcase classname='summary' name='dsc0t-reftest' time='0.01'/>\n\t<testcase classname='summary' name='dsc0t-crashtest' time='0.01'/>\n\t<testcase classname='summary' name='dsc0t-mochitest-1' time='0.01'>\n\t\t<failure message='' type=''>status: 1, stderr: Traceback (most recent call last):</failure>\n\t</testcase>\n\t<testcase classname='summary' name='dsc0t-mochitest-2' time='0.01'>\n\t\t<failure message='' type=''>status: 1, stderr: Traceback (most recent call last):</failure>\n\t</testcase>\n\t<testcase classname='summary' name='dsc0t-mochitest-3' time='0.01'>\n\t\t<failure message='' type=''>status: 1, stderr: Traceback (most recent call last):</failure>\n\t</testcase>\n\t<testcase classname='summary' name='dsc0t-mochitest-4' time='0.01'>\n\t\t<failure message='' type=''>status: 1, stderr: Traceback (most recent call last):</failure>\n\t</testcase>
+ tests=9
+ read t r e
+ + sed -e s~&~\&~g -e s~<~\<~g -e s~>~\>~g -e s~"~\"~g
echo status: 1, stderr: Traceback (most recent call last):
+ e=status: 1, stderr: Traceback (most recent call last):
+ [ FAIL = FAIL ]
+ fails=5
+ tc=\n\t<testcase classname='summary' name='dsc0t-xpcshell-tests' time='0.01'/>\n\t<testcase classname='summary' name='dsc0t-xpcshell-package-tests' time='0.01'/>\n\t<testcase classname='summary' name='dsc0t-jstestbrowser' time='0.01'/>\n\t<testcase classname='summary' name='dsc0t-reftest' time='0.01'/>\n\t<testcase classname='summary' name='dsc0t-crashtest' time='0.01'/>\n\t<testcase classname='summary' name='dsc0t-mochitest-1' time='0.01'>\n\t\t<failure message='' type=''>status: 1, stderr: Traceback (most recent call last):</failure>\n\t</testcase>\n\t<testcase classname='summary' name='dsc0t-mochitest-2' time='0.01'>\n\t\t<failure message='' type=''>status: 1, stderr: Traceback (most recent call last):</failure>\n\t</testcase>\n\t<testcase classname='summary' name='dsc0t-mochitest-3' time='0.01'>\n\t\t<failure message='' type=''>status: 1, stderr: Traceback (most recent call last):</failure>\n\t</testcase>\n\t<testcase classname='summary' name='dsc0t-mochitest-4' time='0.01'>\n\t\t<failure message='' type=''>status: 1, stderr: Traceback (most recent call last):</failure>\n\t</testcase>\n\t<testcase classname='summary' name='dsc0t-mochitest-5' time='0.01'>
+ tc=\n\t<testcase classname='summary' name='dsc0t-xpcshell-tests' time='0.01'/>\n\t<testcase classname='summary' name='dsc0t-xpcshell-package-tests' time='0.01'/>\n\t<testcase classname='summary' name='dsc0t-jstestbrowser' time='0.01'/>\n\t<testcase classname='summary' name='dsc0t-reftest' time='0.01'/>\n\t<testcase classname='summary' name='dsc0t-crashtest' time='0.01'/>\n\t<testcase classname='summary' name='dsc0t-mochitest-1' time='0.01'>\n\t\t<failure message='' type=''>status: 1, stderr: Traceback (most recent call last):</failure>\n\t</testcase>\n\t<testcase classname='summary' name='dsc0t-mochitest-2' time='0.01'>\n\t\t<failure message='' type=''>status: 1, stderr: Traceback (most recent call last):</failure>\n\t</testcase>\n\t<testcase classname='summary' name='dsc0t-mochitest-3' time='0.01'>\n\t\t<failure message='' type=''>status: 1, stderr: Traceback (most recent call last):</failure>\n\t</testcase>\n\t<testcase classname='summary' name='dsc0t-mochitest-4' time='0.01'>\n\t\t<failure message='' type=''>status: 1, stderr: Traceback (most recent call last):</failure>\n\t</testcase>\n\t<testcase classname='summary' name='dsc0t-mochitest-5' time='0.01'>\n\t\t<failure message='' type=''>status: 1, stderr: Traceback (most recent call last):</failure>\n\t</testcase>
+ tests=10
+ read t r e
+ echo status: 1, stderr: Traceback (most recent call last):
+ sed -e s~&~\&~g -e s~<~\<~g -e s~>~\>~g -e s~"~\"~g
+ e=status: 1, stderr: Traceback (most recent call last):
+ [ FAIL = FAIL ]
+ fails=6
+ tc=\n\t<testcase classname='summary' name='dsc0t-xpcshell-tests' time='0.01'/>\n\t<testcase classname='summary' name='dsc0t-xpcshell-package-tests' time='0.01'/>\n\t<testcase classname='summary' name='dsc0t-jstestbrowser' time='0.01'/>\n\t<testcase classname='summary' name='dsc0t-reftest' time='0.01'/>\n\t<testcase classname='summary' name='dsc0t-crashtest' time='0.01'/>\n\t<testcase classname='summary' name='dsc0t-mochitest-1' time='0.01'>\n\t\t<failure message='' type=''>status: 1, stderr: Traceback (most recent call last):</failure>\n\t</testcase>\n\t<testcase classname='summary' name='dsc0t-mochitest-2' time='0.01'>\n\t\t<failure message='' type=''>status: 1, stderr: Traceback (most recent call last):</failure>\n\t</testcase>\n\t<testcase classname='summary' name='dsc0t-mochitest-3' time='0.01'>\n\t\t<failure message='' type=''>status: 1, stderr: Traceback (most recent call last):</failure>\n\t</testcase>\n\t<testcase classname='summary' name='dsc0t-mochitest-4' time='0.01'>\n\t\t<failure message='' type=''>status: 1, stderr: Traceback (most recent call last):</failure>\n\t</testcase>\n\t<testcase classname='summary' name='dsc0t-mochitest-5' time='0.01'>\n\t\t<failure message='' type=''>status: 1, stderr: Traceback (most recent call last):</failure>\n\t</testcase>\n\t<testcase classname='summary' name='dsc0t-mochitest-browser' time='0.01'>
+ tc=\n\t<testcase classname='summary' name='dsc0t-xpcshell-tests' time='0.01'/>\n\t<testcase classname='summary' name='dsc0t-xpcshell-package-tests' time='0.01'/>\n\t<testcase classname='summary' name='dsc0t-jstestbrowser' time='0.01'/>\n\t<testcase classname='summary' name='dsc0t-reftest' time='0.01'/>\n\t<testcase classname='summary' name='dsc0t-crashtest' time='0.01'/>\n\t<testcase classname='summary' name='dsc0t-mochitest-1' time='0.01'>\n\t\t<failure message='' type=''>status: 1, stderr: Traceback (most recent call last):</failure>\n\t</testcase>\n\t<testcase classname='summary' name='dsc0t-mochitest-2' time='0.01'>\n\t\t<failure message='' type=''>status: 1, stderr: Traceback (most recent call last):</failure>\n\t</testcase>\n\t<testcase classname='summary' name='dsc0t-mochitest-3' time='0.01'>\n\t\t<failure message='' type=''>status: 1, stderr: Traceback (most recent call last):</failure>\n\t</testcase>\n\t<testcase classname='summary' name='dsc0t-mochitest-4' time='0.01'>\n\t\t<failure message='' type=''>status: 1, stderr: Traceback (most recent call last):</failure>\n\t</testcase>\n\t<testcase classname='summary' name='dsc0t-mochitest-5' time='0.01'>\n\t\t<failure message='' type=''>status: 1, stderr: Traceback (most recent call last):</failure>\n\t</testcase>\n\t<testcase classname='summary' name='dsc0t-mochitest-browser' time='0.01'>\n\t\t<failure message='' type=''>status: 1, stderr: Traceback (most recent call last):</failure>\n\t</testcase>
+ tests=11
+ read t r e
+ echo status:+  1, stderr: Traceback (most recent call last):
sed -e s~&~\&~g -e s~<~\<~g -e s~>~\>~g -e s~"~\"~g
+ e=status: 1, stderr: Traceback (most recent call last):
+ [ FAIL = FAIL ]
+ fails=7
+ tc=\n\t<testcase classname='summary' name='dsc0t-xpcshell-tests' time='0.01'/>\n\t<testcase classname='summary' name='dsc0t-xpcshell-package-tests' time='0.01'/>\n\t<testcase classname='summary' name='dsc0t-jstestbrowser' time='0.01'/>\n\t<testcase classname='summary' name='dsc0t-reftest' time='0.01'/>\n\t<testcase classname='summary' name='dsc0t-crashtest' time='0.01'/>\n\t<testcase classname='summary' name='dsc0t-mochitest-1' time='0.01'>\n\t\t<failure message='' type=''>status: 1, stderr: Traceback (most recent call last):</failure>\n\t</testcase>\n\t<testcase classname='summary' name='dsc0t-mochitest-2' time='0.01'>\n\t\t<failure message='' type=''>status: 1, stderr: Traceback (most recent call last):</failure>\n\t</testcase>\n\t<testcase classname='summary' name='dsc0t-mochitest-3' time='0.01'>\n\t\t<failure message='' type=''>status: 1, stderr: Traceback (most recent call last):</failure>\n\t</testcase>\n\t<testcase classname='summary' name='dsc0t-mochitest-4' time='0.01'>\n\t\t<failure message='' type=''>status: 1, stderr: Traceback (most recent call last):</failure>\n\t</testcase>\n\t<testcase classname='summary' name='dsc0t-mochitest-5' time='0.01'>\n\t\t<failure message='' type=''>status: 1, stderr: Traceback (most recent call last):</failure>\n\t</testcase>\n\t<testcase classname='summary' name='dsc0t-mochitest-browser' time='0.01'>\n\t\t<failure message='' type=''>status: 1, stderr: Traceback (most recent call last):</failure>\n\t</testcase>\n\t<testcase classname='summary' name='dsc0t-mochitest-chrome' time='0.01'>
+ tc=\n\t<testcase classname='summary' name='dsc0t-xpcshell-tests' time='0.01'/>\n\t<testcase classname='summary' name='dsc0t-xpcshell-package-tests' time='0.01'/>\n\t<testcase classname='summary' name='dsc0t-jstestbrowser' time='0.01'/>\n\t<testcase classname='summary' name='dsc0t-reftest' time='0.01'/>\n\t<testcase classname='summary' name='dsc0t-crashtest' time='0.01'/>\n\t<testcase classname='summary' name='dsc0t-mochitest-1' time='0.01'>\n\t\t<failure message='' type=''>status: 1, stderr: Traceback (most recent call last):</failure>\n\t</testcase>\n\t<testcase classname='summary' name='dsc0t-mochitest-2' time='0.01'>\n\t\t<failure message='' type=''>status: 1, stderr: Traceback (most recent call last):</failure>\n\t</testcase>\n\t<testcase classname='summary' name='dsc0t-mochitest-3' time='0.01'>\n\t\t<failure message='' type=''>status: 1, stderr: Traceback (most recent call last):</failure>\n\t</testcase>\n\t<testcase classname='summary' name='dsc0t-mochitest-4' time='0.01'>\n\t\t<failure message='' type=''>status: 1, stderr: Traceback (most recent call last):</failure>\n\t</testcase>\n\t<testcase classname='summary' name='dsc0t-mochitest-5' time='0.01'>\n\t\t<failure message='' type=''>status: 1, stderr: Traceback (most recent call last):</failure>\n\t</testcase>\n\t<testcase classname='summary' name='dsc0t-mochitest-browser' time='0.01'>\n\t\t<failure message='' type=''>status: 1, stderr: Traceback (most recent call last):</failure>\n\t</testcase>\n\t<testcase classname='summary' name='dsc0t-mochitest-chrome' time='0.01'>\n\t\t<failure message='' type=''>status: 1, stderr: Traceback (most recent call last):</failure>\n\t</testcase>
+ tests=12
+ read t r e
+ echo status: 1, stderr: Traceback (most recent call last):
+ sed -e s~&~\&~g -e s~<~\<~g -e s~>~\>~g -e s~"~\"~g
+ e=status: 1, stderr: Traceback (most recent call last):
+ [ FAIL = FAIL ]
+ fails=8
+ tc=\n\t<testcase classname='summary' name='dsc0t-xpcshell-tests' time='0.01'/>\n\t<testcase classname='summary' name='dsc0t-xpcshell-package-tests' time='0.01'/>\n\t<testcase classname='summary' name='dsc0t-jstestbrowser' time='0.01'/>\n\t<testcase classname='summary' name='dsc0t-reftest' time='0.01'/>\n\t<testcase classname='summary' name='dsc0t-crashtest' time='0.01'/>\n\t<testcase classname='summary' name='dsc0t-mochitest-1' time='0.01'>\n\t\t<failure message='' type=''>status: 1, stderr: Traceback (most recent call last):</failure>\n\t</testcase>\n\t<testcase classname='summary' name='dsc0t-mochitest-2' time='0.01'>\n\t\t<failure message='' type=''>status: 1, stderr: Traceback (most recent call last):</failure>\n\t</testcase>\n\t<testcase classname='summary' name='dsc0t-mochitest-3' time='0.01'>\n\t\t<failure message='' type=''>status: 1, stderr: Traceback (most recent call last):</failure>\n\t</testcase>\n\t<testcase classname='summary' name='dsc0t-mochitest-4' time='0.01'>\n\t\t<failure message='' type=''>status: 1, stderr: Traceback (most recent call last):</failure>\n\t</testcase>\n\t<testcase classname='summary' name='dsc0t-mochitest-5' time='0.01'>\n\t\t<failure message='' type=''>status: 1, stderr: Traceback (most recent call last):</failure>\n\t</testcase>\n\t<testcase classname='summary' name='dsc0t-mochitest-browser' time='0.01'>\n\t\t<failure message='' type=''>status: 1, stderr: Traceback (most recent call last):</failure>\n\t</testcase>\n\t<testcase classname='summary' name='dsc0t-mochitest-chrome' time='0.01'>\n\t\t<failure message='' type=''>status: 1, stderr: Traceback (most recent call last):</failure>\n\t</testcase>\n\t<testcase classname='summary' name='dsc0t-mochitest-a11y' time='0.01'>
+ tc=\n\t<testcase classname='summary' name='dsc0t-xpcshell-tests' time='0.01'/>\n\t<testcase classname='summary' name='dsc0t-xpcshell-package-tests' time='0.01'/>\n\t<testcase classname='summary' name='dsc0t-jstestbrowser' time='0.01'/>\n\t<testcase classname='summary' name='dsc0t-reftest' time='0.01'/>\n\t<testcase classname='summary' name='dsc0t-crashtest' time='0.01'/>\n\t<testcase classname='summary' name='dsc0t-mochitest-1' time='0.01'>\n\t\t<failure message='' type=''>status: 1, stderr: Traceback (most recent call last):</failure>\n\t</testcase>\n\t<testcase classname='summary' name='dsc0t-mochitest-2' time='0.01'>\n\t\t<failure message='' type=''>status: 1, stderr: Traceback (most recent call last):</failure>\n\t</testcase>\n\t<testcase classname='summary' name='dsc0t-mochitest-3' time='0.01'>\n\t\t<failure message='' type=''>status: 1, stderr: Traceback (most recent call last):</failure>\n\t</testcase>\n\t<testcase classname='summary' name='dsc0t-mochitest-4' time='0.01'>\n\t\t<failure message='' type=''>status: 1, stderr: Traceback (most recent call last):</failure>\n\t</testcase>\n\t<testcase classname='summary' name='dsc0t-mochitest-5' time='0.01'>\n\t\t<failure message='' type=''>status: 1, stderr: Traceback (most recent call last):</failure>\n\t</testcase>\n\t<testcase classname='summary' name='dsc0t-mochitest-browser' time='0.01'>\n\t\t<failure message='' type=''>status: 1, stderr: Traceback (most recent call last):</failure>\n\t</testcase>\n\t<testcase classname='summary' name='dsc0t-mochitest-chrome' time='0.01'>\n\t\t<failure message='' type=''>status: 1, stderr: Traceback (most recent call last):</failure>\n\t</testcase>\n\t<testcase classname='summary' name='dsc0t-mochitest-a11y' time='0.01'>\n\t\t<failure message='' type=''>status: 1, stderr: Traceback (most recent call last):</failure>\n\t</testcase>
+ tests=13
+ read t r e
+ echo status: 1, stderr: Traceback (most recent call last):
+ sed -e s~&~\&~g -e s~<~\<~g -e s~>~\>~g -e s~"~\"~g
+ e=status: 1, stderr: Traceback (most recent call last):
+ [ FAIL = FAIL ]
+ fails=9
+ tc=\n\t<testcase classname='summary' name='dsc0t-xpcshell-tests' time='0.01'/>\n\t<testcase classname='summary' name='dsc0t-xpcshell-package-tests' time='0.01'/>\n\t<testcase classname='summary' name='dsc0t-jstestbrowser' time='0.01'/>\n\t<testcase classname='summary' name='dsc0t-reftest' time='0.01'/>\n\t<testcase classname='summary' name='dsc0t-crashtest' time='0.01'/>\n\t<testcase classname='summary' name='dsc0t-mochitest-1' time='0.01'>\n\t\t<failure message='' type=''>status: 1, stderr: Traceback (most recent call last):</failure>\n\t</testcase>\n\t<testcase classname='summary' name='dsc0t-mochitest-2' time='0.01'>\n\t\t<failure message='' type=''>status: 1, stderr: Traceback (most recent call last):</failure>\n\t</testcase>\n\t<testcase classname='summary' name='dsc0t-mochitest-3' time='0.01'>\n\t\t<failure message='' type=''>status: 1, stderr: Traceback (most recent call last):</failure>\n\t</testcase>\n\t<testcase classname='summary' name='dsc0t-mochitest-4' time='0.01'>\n\t\t<failure message='' type=''>status: 1, stderr: Traceback (most recent call last):</failure>\n\t</testcase>\n\t<testcase classname='summary' name='dsc0t-mochitest-5' time='0.01'>\n\t\t<failure message='' type=''>status: 1, stderr: Traceback (most recent call last):</failure>\n\t</testcase>\n\t<testcase classname='summary' name='dsc0t-mochitest-browser' time='0.01'>\n\t\t<failure message='' type=''>status: 1, stderr: Traceback (most recent call last):</failure>\n\t</testcase>\n\t<testcase classname='summary' name='dsc0t-mochitest-chrome' time='0.01'>\n\t\t<failure message='' type=''>status: 1, stderr: Traceback (most recent call last):</failure>\n\t</testcase>\n\t<testcase classname='summary' name='dsc0t-mochitest-a11y' time='0.01'>\n\t\t<failure message='' type=''>status: 1, stderr: Traceback (most recent call last):</failure>\n\t</testcase>\n\t<testcase classname='summary' name='dsc0t-mochitest-ipcplugins' time='0.01'>
+ tc=\n\t<testcase classname='summary' name='dsc0t-xpcshell-tests' time='0.01'/>\n\t<testcase classname='summary' name='dsc0t-xpcshell-package-tests' time='0.01'/>\n\t<testcase classname='summary' name='dsc0t-jstestbrowser' time='0.01'/>\n\t<testcase classname='summary' name='dsc0t-reftest' time='0.01'/>\n\t<testcase classname='summary' name='dsc0t-crashtest' time='0.01'/>\n\t<testcase classname='summary' name='dsc0t-mochitest-1' time='0.01'>\n\t\t<failure message='' type=''>status: 1, stderr: Traceback (most recent call last):</failure>\n\t</testcase>\n\t<testcase classname='summary' name='dsc0t-mochitest-2' time='0.01'>\n\t\t<failure message='' type=''>status: 1, stderr: Traceback (most recent call last):</failure>\n\t</testcase>\n\t<testcase classname='summary' name='dsc0t-mochitest-3' time='0.01'>\n\t\t<failure message='' type=''>status: 1, stderr: Traceback (most recent call last):</failure>\n\t</testcase>\n\t<testcase classname='summary' name='dsc0t-mochitest-4' time='0.01'>\n\t\t<failure message='' type=''>status: 1, stderr: Traceback (most recent call last):</failure>\n\t</testcase>\n\t<testcase classname='summary' name='dsc0t-mochitest-5' time='0.01'>\n\t\t<failure message='' type=''>status: 1, stderr: Traceback (most recent call last):</failure>\n\t</testcase>\n\t<testcase classname='summary' name='dsc0t-mochitest-browser' time='0.01'>\n\t\t<failure message='' type=''>status: 1, stderr: Traceback (most recent call last):</failure>\n\t</testcase>\n\t<testcase classname='summary' name='dsc0t-mochitest-chrome' time='0.01'>\n\t\t<failure message='' type=''>status: 1, stderr: Traceback (most recent call last):</failure>\n\t</testcase>\n\t<testcase classname='summary' name='dsc0t-mochitest-a11y' time='0.01'>\n\t\t<failure message='' type=''>status: 1, stderr: Traceback (most recent call last):</failure>\n\t</testcase>\n\t<testcase classname='summary' name='dsc0t-mochitest-ipcplugins' time='0.01'>\n\t\t<failure message='' type=''>status: 1, stderr: Traceback (most recent call last):</failure>\n\t</testcase>
+ tests=14
+ read t r e
+ echo
+ sed -e s~&~\&~g -e s~<~\<~g -e s~>~\>~g -e s~"~\"~g
+ e=
+ [ PASS = FAIL ]
+ tc=\n\t<testcase classname='summary' name='dsc0t-xpcshell-tests' time='0.01'/>\n\t<testcase classname='summary' name='dsc0t-xpcshell-package-tests' time='0.01'/>\n\t<testcase classname='summary' name='dsc0t-jstestbrowser' time='0.01'/>\n\t<testcase classname='summary' name='dsc0t-reftest' time='0.01'/>\n\t<testcase classname='summary' name='dsc0t-crashtest' time='0.01'/>\n\t<testcase classname='summary' name='dsc0t-mochitest-1' time='0.01'>\n\t\t<failure message='' type=''>status: 1, stderr: Traceback (most recent call last):</failure>\n\t</testcase>\n\t<testcase classname='summary' name='dsc0t-mochitest-2' time='0.01'>\n\t\t<failure message='' type=''>status: 1, stderr: Traceback (most recent call last):</failure>\n\t</testcase>\n\t<testcase classname='summary' name='dsc0t-mochitest-3' time='0.01'>\n\t\t<failure message='' type=''>status: 1, stderr: Traceback (most recent call last):</failure>\n\t</testcase>\n\t<testcase classname='summary' name='dsc0t-mochitest-4' time='0.01'>\n\t\t<failure message='' type=''>status: 1, stderr: Traceback (most recent call last):</failure>\n\t</testcase>\n\t<testcase classname='summary' name='dsc0t-mochitest-5' time='0.01'>\n\t\t<failure message='' type=''>status: 1, stderr: Traceback (most recent call last):</failure>\n\t</testcase>\n\t<testcase classname='summary' name='dsc0t-mochitest-browser' time='0.01'>\n\t\t<failure message='' type=''>status: 1, stderr: Traceback (most recent call last):</failure>\n\t</testcase>\n\t<testcase classname='summary' name='dsc0t-mochitest-chrome' time='0.01'>\n\t\t<failure message='' type=''>status: 1, stderr: Traceback (most recent call last):</failure>\n\t</testcase>\n\t<testcase classname='summary' name='dsc0t-mochitest-a11y' time='0.01'>\n\t\t<failure message='' type=''>status: 1, stderr: Traceback (most recent call last):</failure>\n\t</testcase>\n\t<testcase classname='summary' name='dsc0t-mochitest-ipcplugins' time='0.01'>\n\t\t<failure message='' type=''>status: 1, stderr: Traceback (most recent call last):</failure>\n\t</testcase>\n\t<testcase classname='summary' name='dsc0t-post-process' time='0.01'/>
+ tests=15
+ read t r e
+ echo -n <?xml version='1.0' encoding='utf-8'?>
<testsuite failures='9' name='summary' skipped='0' tests='15'>
+ echo \n\t<testcase classname='summary' name='dsc0t-xpcshell-tests' time='0.01'/>\n\t<testcase classname='summary' name='dsc0t-xpcshell-package-tests' time='0.01'/>\n\t<testcase classname='summary' name='dsc0t-jstestbrowser' time='0.01'/>\n\t<testcase classname='summary' name='dsc0t-reftest' time='0.01'/>\n\t<testcase classname='summary' name='dsc0t-crashtest' time='0.01'/>\n\t<testcase classname='summary' name='dsc0t-mochitest-1' time='0.01'>\n\t\t<failure message='' type=''>status: 1, stderr: Traceback (most recent call last):</failure>\n\t</testcase>\n\t<testcase classname='summary' name='dsc0t-mochitest-2' time='0.01'>\n\t\t<failure message='' type=''>status: 1, stderr: Traceback (most recent call last):</failure>\n\t</testcase>\n\t<testcase classname='summary' name='dsc0t-mochitest-3' time='0.01'>\n\t\t<failure message='' type=''>status: 1, stderr: Traceback (most recent call last):</failure>\n\t</testcase>\n\t<testcase classname='summary' name='dsc0t-mochitest-4' time='0.01'>\n\t\t<failure message='' type=''>status: 1, stderr: Traceback (most recent call last):</failure>\n\t</testcase>\n\t<testcase classname='summary' name='dsc0t-mochitest-5' time='0.01'>\n\t\t<failure message='' type=''>status: 1, stderr: Traceback (most recent call last):</failure>\n\t</testcase>\n\t<testcase classname='summary' name='dsc0t-mochitest-browser' time='0.01'>\n\t\t<failure message='' type=''>status: 1, stderr: Traceback (most recent call last):</failure>\n\t</testcase>\n\t<testcase classname='summary' name='dsc0t-mochitest-chrome' time='0.01'>\n\t\t<failure message='' type=''>status: 1, stderr: Traceback (most recent call last):</failure>\n\t</testcase>\n\t<testcase classname='summary' name='dsc0t-mochitest-a11y' time='0.01'>\n\t\t<failure message='' type=''>status: 1, stderr: Traceback (most recent call last):</failure>\n\t</testcase>\n\t<testcase classname='summary' name='dsc0t-mochitest-ipcplugins' time='0.01'>\n\t\t<failure message='' type=''>status: 1, stderr: Traceback (most recent call last):</failure>\n\t</testcase>\n\t<testcase classname='summary' name='dsc0t-post-process' time='0.01'/>
+ echo </testsuite>
+ [ -n 2013-09-23_07-00-53 ]
+ log_info_msg Updating Jenkins results
+ log_msg Info: Updating Jenkins results\n
+ date +%F %X
+ printf 2013-09-23 04:31:08 AM: Info: Updating Jenkins results\n
2013-09-23 04:31:08 AM: Info: Updating Jenkins results
+ rsync -a <http://10.189.74.2:8080/job/raring-ppa-adt-ubuntu_mozilla_daily_ppa-firefox-trunk/./ARCH=i386,label=adt/ws/results/raring_i386_firefox-trunk_20130923-043100.result> rsync://jiufeng/adt//raring/out/
+ [ 0 -eq 0 ]
+ ssh -o UserKnownHostsFile=/dev/null -o StrictHostKeyChecking=no -o CheckHostIP=no -i /home/auto-package-testing/cache/disks/adtkey -p 54323 -tt -o BatchMode=yes -l ubuntu localhost sudo poweroff
Warning: Permanently added '[localhost]:54323' (ECDSA) to the list of known hosts.
Connection to localhost closed.
+ exit 4
+ on_exit
+ log_info_msg Cleaning up
+ log_msg Info: Cleaning up\n
+ date +%F %X
+ printf 2013-09-23 04:31:09 AM: Info: Cleaning up\n
2013-09-23 04:31:09 AM: Info: Cleaning up
+ [ -f /home/auto-package-testing/cache/disks/run/raring-i386-firefox-trunk-20130923_030054.PEiCHS.img.pid ]
+ cat /home/auto-package-testing/cache/disks/run/raring-i386-firefox-trunk-20130923_030054.PEiCHS.img.pid
+ kill -9 12936
+ rm -f /home/auto-package-testing/cache/disks/run/raring-i386-firefox-trunk-20130923_030054.PEiCHS.img.pid
+ rm -f /home/auto-package-testing/cache/disks/run/raring-i386-firefox-trunk-20130923_030054.PEiCHS.img
+ rm -f /home/auto-package-testing/cache/disks/run/raring-i386-firefox-trunk-20130923_030054.PEiCHS.img.monitor
+ rm -f /var/lock/adt/ssh.54323.lock
+ rm -f /var/lock/adt/vnc.5911.lock
+ [ -d /tmp/adt-i386.QqqcyB ]
+ rm -Rf /tmp/adt-i386.QqqcyB
+ rm -f /home/auto-package-testing/cache/disks/run/raring-i386-firefox-trunk-*.img*
+ find /var/lock/adt -name *.lock -mtime +1
+ exit 4
Build step 'Execute shell' marked build as failure
Archiving artifacts
Recording test results



More information about the ubuntu-testing-notifications mailing list