Build failed in Jenkins: precise-upgrade-oneiric-server-updates » i386,non-lts,server-updates,upgrade-test #113

Jenkins Notification devnull at canonical.com
Tue Apr 30 11:56:23 UTC 2013


See <http://10.189.74.2:8080/job/precise-upgrade-oneiric-server-updates/./ARCH=i386,LTS=non-lts,PROFILE=server-updates,label=upgrade-test/113/>

------------------------------------------
Started by upstream project "precise-upgrade-oneiric-server-updates" build number 113
[EnvInject] - Loading node environment variables.
Building remotely on aldebaran-upgrade
No emails were triggered.
[upgrade-test] $ /bin/sh -x /tmp/hudson3860450290843477229.sh
+ rm -Rf auto-upgrade-testing results
+ BRANCH=auto-upgrade-testing
+ [ -d auto-upgrade-testing ]
+ bzr branch lp:auto-upgrade-testing
You have not informed bzr of your Launchpad ID, and you must do this to
write to Launchpad or access private data.  See "bzr help launchpad-login".
Branched 74 revisions.
+ cd auto-upgrade-testing
+ LTSPREFIX=
+ ARCHEXT=
+ BASEDIR=/var/home/upgrade-tester/auto-upgrade-tester
+ [ non-lts = non-lts ]
+ LTSPREFIX=
+ ARCHEXT=i386
+ PROFILENAME=server-updates-i386
+ [ i386 = i386 ]
+ [ ! -e /var/home/upgrade-tester/auto-upgrade-tester/profiles/server-updates-i386 ]
+ PROFILENAME=server-updates
+ echo Running profile server-updates
Running profile server-updates
+ python bin/auto-upgrade-tester /var/home/upgrade-tester/auto-upgrade-tester/profiles/server-updates
Testing '/var/home/upgrade-tester/auto-upgrade-tester/profiles/server-updates'
Port 54322 already locked. Skipping!
using ssh port: 54323
Port 5901 already in use. Skipping!
Port 5902 already in use. Skipping!
Port 5903 already in use. Skipping!
Port 5904 already in use. Skipping!
Port 5905 already in use. Skipping!
Port 5906 already in use. Skipping!
Port 5907 already locked. Skipping!
using VncNum: 5908
Storing the result in '/var/home/upgrade-tester/auto-upgrade-tester/result/server-updates'
2013-04-30 11:26:10.076104 log started
bootstrap()
Not bootstrapping again, we have a cached BaseImage
upgrade()
Starting for upgrade
Starting ['kvm', '-hda', '/var/home/upgrade-tester/auto-upgrade-tester/test-image.server-updates', '-monitor', 'stdio', '-localtime', '-no-reboot', '-net', 'nic,model=virtio', '-net', 'user', '-redir', 'tcp:54323::22', '-vnc', 'localhost:8', '-m', '1536']
Could not start image after 900s, exiting
FAILED: upgrade for '/var/home/upgrade-tester/auto-upgrade-tester/profiles/server-updates'
Failed to upgrade /var/home/upgrade-tester/auto-upgrade-tester/profiles/server-updates
Logs can be found here:
 /var/home/upgrade-tester/auto-upgrade-tester/result/server-updates/bootstrap.log
 /var/home/upgrade-tester/auto-upgrade-tester/result/server-updates/main.log
 /var/home/upgrade-tester/auto-upgrade-tester/result/server-updates/apt.log
2013-04-30 11:43:40.786890 log ended.
Duration: 0:17:30.710786
Profile '/var/home/upgrade-tester/auto-upgrade-tester/profiles/server-updates' FAILED
stop
stop pid:  <subprocess.Popen object at 0x12e76d0>
waiting for qemu to shutdown
Not stopped after 600s, killing 
qemu stopped
Releasing lock: /var/lock/auto-upgrade-tester.54323.lock
Releasing lock: /var/lock/auto-upgrade-tester.5908.lock
+ cp -ar /var/home/upgrade-tester/auto-upgrade-tester/result/server-updates/ <http://10.189.74.2:8080/job/precise-upgrade-oneiric-server-updates/./ARCH=i386,LTS=non-lts,PROFILE=server-updates,label=upgrade-test/ws/results>
Archiving artifacts
Recording test results
No test report files were found. Configuration error?
Build step 'Publish JUnit test result report' changed build result to FAILURE



More information about the ubuntu-testing-notifications mailing list