Build failed in Jenkins: raring-upgrade-quantal-server » amd64,non-lts,server-tasks,upgrade-test #116

Jenkins Notification devnull at canonical.com
Fri Mar 8 23:16:25 UTC 2013


See <http://10.189.74.2:8080/job/raring-upgrade-quantal-server/./ARCH=amd64,LTS=non-lts,PROFILE=server-tasks,label=upgrade-test/116/>

------------------------------------------
[...truncated 4186 lines...]
rsyslog start/running, process 25020

Setting up sudo (1.8.6p3-0ubuntu3) ...

Setting up locales (2.13+git20120306-8) ...

Generating locales...

  en_US.UTF-8... up-to-date

Generation complete.

Setting up ureadahead (0.100.0-14) ...

Setting up vim-common (2:7.3.547-6ubuntu4) ...

Setting up vim-tiny (2:7.3.547-6ubuntu4) ...

Setting up whiptail (0.52.14-11ubuntu6) ...

Setting up apt-transport-https (0.9.7.7ubuntu2) ...

Setting up libisc92 (1:9.9.2.dfsg.P1-2) ...

Setting up libdns95 (1:9.9.2.dfsg.P1-2) ...

Setting up libisccc90 (1:9.9.2.dfsg.P1-2) ...

Setting up libisccfg90 (1:9.9.2.dfsg.P1-2) ...

Setting up libbind9-90 (1:9.9.2.dfsg.P1-2) ...

Setting up liblwres90 (1:9.9.2.dfsg.P1-2) ...

Setting up bind9-host (1:9.9.2.dfsg.P1-2) ...

Setting up busybox-static (1:1.20.0-7ubuntu3) ...

Setting up openssl (1.0.1c-4ubuntu7) ...

Setting up ca-certificates (20130119) ...

Setting up command-not-found-data (0.3ubuntu7) ...

Setting up python3-gdbm:amd64 (3.3.0-1ubuntu2) ...

Setting up python3-commandnotfound (0.3ubuntu7) ...

Setting up command-not-found (0.3ubuntu7) ...

Setting up dnsutils (1:9.9.2.dfsg.P1-2) ...

Setting up dosfstools (3.0.14-1ubuntu1) ...

Setting up ed (1.6-2ubuntu1) ...

Setting up ftp (0.17-28) ...

Setting up gettext-base (0.18.1.1-10ubuntu3) ...

Setting up info (4.13a.dfsg.1-10ubuntu4) ...

Setting up libnfnetlink0 (1.0.0-1.1ubuntu1) ...

Setting up iptables (1.4.12-2ubuntu5) ...

Setting up libnuma1 (2.0.8-1) ...

Setting up irqbalance (1.0.5-2) ...

irqbalance stop/waiting

Setting up krb5-locales (1.10.1+dfsg-4) ...

Setting up lsof (4.86+dfsg-1ubuntu2) ...

Setting up manpages (3.44-0ubuntu1) ...

Setting up memtest86+ (4.20-1.1ubuntu3) ...

Setting up mlocate (0.25-0ubuntu2) ...

Setting up openssh-client (1:6.1p1-3) ...

Installing new version of config file /etc/ssh/moduli ...

dpkg: unrecoverable fatal error, aborting:

 unable to fsync updated status of `openssh-client': Input/output error

Error in function: 

SystemError: E:Sub-process /usr/bin/dpkg returned an error code (2)

Setting up tcpd (7.6.q-24) ...
Setting up python-six (1.2.0-1) ...
Setting up libpq5 (9.1.8-1) ...
Processing triggers for initramfs-tools ...
update-initramfs: Generating /boot/initrd.img-3.5.0-18-generic
Setting up postgresql-client-9.1 (9.1.8-1) ...
Setting up bind9-doc (1:9.9.2.dfsg.P1-2) ...
Setting up libsnmp-base (5.4.3~dfsg-2.7ubuntu1) ...
Setting up os-prober (1.57ubuntu1) ...
Setting up dovecot-core (1:2.1.7-7ubuntu1) ...
Installing new version of config file /etc/dovecot/README ...
Replacing config file /etc/dovecot/conf.d/10-mail.conf with new version
Replacing config file /etc/dovecot/conf.d/10-ssl.conf with new version

Creating config file /etc/dovecot/conf.d/10-tcpwrapper.conf with new version

Creating config file /etc/dovecot/conf.d/15-mailboxes.conf with new version

Creating config file /etc/dovecot/conf.d/auth-checkpassword.conf.ext with new version

Creating config file /etc/dovecot/conf.d/auth-sql.conf.ext with new version
You already have ssl certs for dovecot.
However you should move them out of /etc/ssl
and into /etc/dovecot and update the configuration
in /etc/dovecot/conf.d/10-ssl.conf accordingly.
See /usr/share/doc/dovecot-core/README.Debian.gz for details.
Creating compat symlink for /etc/ssl/certs/dovecot.pem
Creating compat symlink for /etc/ssl/private/dovecot.pem
You already have ssl certs for dovecot.
dovecot start/running, process 3063
Setting up libgpgme11 (1.2.0-1.4ubuntu4) ...
Setting up rsync (3.0.9-4) ...
Setting up ppp (2.4.5-5.1ubuntu2) ...
Setting up postfix (2.9.6-1) ...
Installing new version of config file /etc/init.d/postfix ...

Postfix configuration was untouched.  If you need to make changes, edit
/etc/postfix/main.cf (and others) as needed.  To view Postfix configuration
values, see postconf(1).

After modifying main.cf, be sure to run '/etc/init.d/postfix reload'.

Running newaliases
 * Stopping Postfix Mail Transport Agent postfix
   ...done.
 * Starting Postfix Mail Transport Agent postfix
   ...done.
Setting up usbutils (1:005-3ubuntu1) ...
Setting up libsnmp15 (5.4.3~dfsg-2.7ubuntu1) ...
Setting up keyutils (1.5.5-4) ...
Setting up wget (1.14-1ubuntu1) ...
Setting up uuid-runtime (2.20.1-5.1ubuntu8) ...
Setting up libpaper-utils (1.1.24+nmu2ubuntu2) ...
Setting up plymouth-theme-ubuntu-text (0.8.8-0ubuntu6) ...
update-initramfs: deferring update (trigger activated)
Setting up libhpmud0 (3.13.2-0ubuntu1) ...
Setting up xauth (1:1.0.7-1ubuntu1) ...
Setting up ufw (0.33-0ubuntu3) ...
Setting up postgresql-client (9.1+140) ...
Setting up ncurses-term (5.9-10ubuntu4) ...
Setting up postgresql-doc-9.1 (9.1.8-1) ...
Setting up postgresql-9.1 (9.1.8-1) ...
 * Starting PostgreSQL 9.1 database server
   ...done.
Setting up python-chardet (2.0.1-2build1) ...
Setting up bind9utils (1:9.9.2.dfsg.P1-2) ...
Processing triggers for libc-bin ...
ldconfig deferred processing now taking place
Setting up linux-firmware (1.103) ...
Setting up tdb-tools (1.2.10-2ubuntu1) ...
update-alternatives: using /usr/bin/tdbbackup.tdbtools to provide /usr/bin/tdbbackup (tdbbackup) in auto mode
Setting up xml-core (0.13+nmu2) ...
Setting up dovecot-imapd (1:2.1.7-7ubuntu1) ...
dovecot stop/waiting
dovecot start/running, process 3695
Setting up python-apt (0.8.8ubuntu6) ...
Setting up openssh-client (1:6.1p1-3) ...
Setting up ghostscript-cups (9.06~dfsg-0ubuntu5) ...
Setting up postgresql-contrib-9.1 (9.1.8-1) ...
Setting up cups-browsed (1.0.30-0ubuntu1) ...
cups-browsed start/running, process 3788
Setting up bind9 (1:9.9.2.dfsg.P1-2) ...
Installing new version of config file /etc/apparmor.d/usr.sbin.named ...
Installing new version of config file /etc/bind/bind.keys ...
Installing new version of config file /etc/bind/db.root ...
#
 * Stopping domain name service... bind9
waiting for pid 1028 to die
   ...done.
 * Starting domain name service... bind9
   ...done.
Processing triggers for ca-certificates ...
Updating certificates in /etc/ssl/certs... 7 added, 0 removed; done.
Running hooks in /etc/ca-certificates/update.d....done.
Setting up dconf-service (0.15.3-0ubuntu1) ...
Setting up policykit-1 (0.105-1ubuntu1) ...
Setting up python-urllib3 (1.5-0ubuntu1) ...
Setting up postgresql-contrib (9.1+140) ...
Setting up printer-driver-hpijs (3.13.2-0ubuntu1) ...
Setting up mutt (1.5.21-6.2) ...
Setting up hpijs (3.13.2-0ubuntu1) ...
Setting up python-requests (1.1.0-1) ...
Setting up dovecot-pop3d (1:2.1.7-7ubuntu1) ...
dovecot stop/waiting
dovecot start/running, process 5462
Setting up pppconfig (2.3.19ubuntu1) ...
Installing new version of config file /etc/init.d/dns-clean ...
Setting up postgresql-doc (9.1+140) ...
Setting up openssh-server (1:6.1p1-3) ...
Installing new version of config file /etc/network/if-up.d/openssh-server ...
Installing new version of config file /etc/init.d/ssh ...
ssh stop/waiting
ssh start/running, process 5511
Setting up postgresql (9.1+140) ...
Setting up dconf-gsettings-backend:amd64 (0.15.3-0ubuntu1) ...
Setting up ssh-import-id (3.13-0ubuntu1) ...
Installing new version of config file /etc/ssh/ssh_import_id ...
Setting up colord (0.1.30-0ubuntu3) ...
Installing new version of config file /etc/bash_completion.d/colormgr-completion.bash ...
Installing new version of config file /etc/colord.conf ...
Pr2013-03-08 23:02:24.085617 log started
bootstrap()
Not bootstrapping again, we have a cached BaseImage
upgrade()
Starting for upgrade
Starting ['kvm', '-hda', '/home/upgrade-tester//auto-upgrade-tester/test-image.raring-server-tasks-amd64', '-monitor', 'stdio', '-localtime', '-no-reboot', '-net', 'nic,model=virtio', '-net', 'user', '-redir', 'tcp:54323::22', '-vnc', 'localhost:5', '-m', '1536']
Copying '/home/upgrade-tester/auto-upgrade-tester/profiles/raring-server-tasks-amd64/DistUpgrade.cfg' to image overrides
Copying '/home/upgrade-tester/auto-upgrade-tester/profiles/override.cfg.d/global.cfg' to image overrides
Disabling ForceOverwrite
Using do-release-upgrade for the upgrade
dist-upgrade.py returned: 1
coyping the result
Shuting down the VM
stop
stop pid:  <subprocess.Popen object at 0x18a7810>
waiting for qemu to shutdown
poll() returned
qemu stopped
FAILED: upgrade for '/home/upgrade-tester/auto-upgrade-tester/profiles/raring-server-tasks-amd64'
Failed to upgrade /home/upgrade-tester/auto-upgrade-tester/profiles/raring-server-tasks-amd64
Logs can be found here:
 /home/upgrade-tester/auto-upgrade-tester/result/raring-server-tasks-amd64/bootstrap.log
 /home/upgrade-tester/auto-upgrade-tester/result/raring-server-tasks-amd64/main.log
 /home/upgrade-tester/auto-upgrade-tester/result/raring-server-tasks-amd64/apt.log
2013-03-08 23:10:47.378185 log ended.
Duration: 0:08:23.292568
Profile '/home/upgrade-tester/auto-upgrade-tester/profiles/raring-server-tasks-amd64' FAILED
stop
Releasing lock: /var/lock/auto-upgrade-tester.54323.lock
Releasing lock: /var/lock/auto-upgrade-tester.5905.lock
+ cp -ar /home/upgrade-tester/auto-upgrade-tester/result/raring-server-tasks-amd64/ <http://10.189.74.2:8080/job/raring-upgrade-quantal-server/./ARCH=amd64,LTS=non-lts,PROFILE=server-tasks,label=upgrade-test/ws/results>
Archiving artifacts
Recording test results
No test report files were found. Configuration error?
Build step 'Publish JUnit test result report' changed build result to FAILURE



More information about the ubuntu-testing-notifications mailing list