Build failed in Jenkins: precise-upgrade-oneiric-server » amd64,non-lts,server,upgrade-test #427

Jenkins Notification devnull at canonical.com
Fri Mar 8 21:31:39 UTC 2013


See <http://10.189.74.2:8080/job/precise-upgrade-oneiric-server/./ARCH=amd64,LTS=non-lts,PROFILE=server,label=upgrade-test/427/>

------------------------------------------
Started by upstream project "precise-upgrade-oneiric-server" build number 427
[EnvInject] - Loading node environment variables.
Building remotely on wazn-upgrade
No emails were triggered.
[upgrade-test] $ /bin/sh -x /tmp/hudson4816208096577832153.sh
+ rm -Rf auto-upgrade-testing results
+ BRANCH=auto-upgrade-testing
+ [ -d auto-upgrade-testing ]
+ bzr branch lp:auto-upgrade-testing
You have not informed bzr of your Launchpad ID, and you must do this to
write to Launchpad or access private data.  See "bzr help launchpad-login".
Branched 74 revisions.
+ cd auto-upgrade-testing
+ LTSPREFIX=
+ ARCHEXT=
+ BASEDIR=/home/upgrade-tester/auto-upgrade-tester
+ [ non-lts = non-lts ]
+ LTSPREFIX=
+ ARCHEXT=amd64
+ PROFILENAME=server-amd64
+ [ amd64 = i386 ]
+ echo Running profile server-amd64
Running profile server-amd64
+ python bin/auto-upgrade-tester /home/upgrade-tester/auto-upgrade-tester/profiles/server-amd64
Testing '/home/upgrade-tester/auto-upgrade-tester/profiles/server-amd64'
Port 54322 already in use. Skipping!
using ssh port: 54323
Port 5901 already in use. Skipping!
Port 5902 already in use. Skipping!
Port 5903 already in use. Skipping!
Port 5904 already in use. Skipping!
using VncNum: 5905
Storing the result in '/home/upgrade-tester/auto-upgrade-tester/result/server-amd64'
2013-03-08 20:55:25.317054 log started
bootstrap()
Not bootstrapping again, we have a cached BaseImage
upgrade()
Starting for upgrade
Starting ['kvm', '-hda', '/home/upgrade-tester//auto-upgrade-tester/test-image.server-amd64', '-monitor', 'stdio', '-localtime', '-no-reboot', '-net', 'nic,model=virtio', '-net', 'user', '-redir', 'tcp:54323::22', '-vnc', 'localhost:5', '-m', '1536']
Could not start image after 900s, exiting
FAILED: upgrade for '/home/upgrade-tester/auto-upgrade-tester/profiles/server-amd64'
Failed to upgrade /home/upgrade-tester/auto-upgrade-tester/profiles/server-amd64
Logs can be found here:
 /home/upgrade-tester/auto-upgrade-tester/result/server-amd64/bootstrap.log
 /home/upgrade-tester/auto-upgrade-tester/result/server-amd64/main.log
 /home/upgrade-tester/auto-upgrade-tester/result/server-amd64/apt.log
2013-03-08 21:13:20.195106 log ended.
Duration: 0:17:54.878052
Profile '/home/upgrade-tester/auto-upgrade-tester/profiles/server-amd64' FAILED
stop
stop pid:  <subprocess.Popen object at 0x177b790>
waiting for qemu to shutdown
Not stopped after 600s, killing 
qemu stopped
Releasing lock: /var/lock/auto-upgrade-tester.54323.lock
Releasing lock: /var/lock/auto-upgrade-tester.5905.lock
+ cp -ar /home/upgrade-tester/auto-upgrade-tester/result/server-amd64/ <http://10.189.74.2:8080/job/precise-upgrade-oneiric-server/./ARCH=amd64,LTS=non-lts,PROFILE=server,label=upgrade-test/ws/results>
Archiving artifacts
Recording test results
No test report files were found. Configuration error?
Build step 'Publish JUnit test result report' changed build result to FAILURE



More information about the ubuntu-testing-notifications mailing list