Build failed in Jenkins: precise-upgrade-oneiric-main » i386,non-lts,main-all,upgrade-test #401

Jenkins Notification devnull at canonical.com
Fri Mar 8 17:20:07 UTC 2013


See <http://10.189.74.2:8080/job/precise-upgrade-oneiric-main/./ARCH=i386,LTS=non-lts,PROFILE=main-all,label=upgrade-test/401/>

------------------------------------------
Started by upstream project "precise-upgrade-oneiric-main" build number 401
[EnvInject] - Loading node environment variables.
Building remotely on aldebaran-upgrade
No emails were triggered.
[upgrade-test] $ /bin/sh -x /tmp/hudson5832971154924571798.sh
+ rm -Rf auto-upgrade-testing results
+ BRANCH=auto-upgrade-testing
+ [ -d auto-upgrade-testing ]
+ bzr branch lp:auto-upgrade-testing
You have not informed bzr of your Launchpad ID, and you must do this to
write to Launchpad or access private data.  See "bzr help launchpad-login".
Branched 74 revisions.
+ cd auto-upgrade-testing
+ LTSPREFIX=
+ ARCHEXT=
+ BASEDIR=/var/home/upgrade-tester/auto-upgrade-tester
+ [ non-lts = non-lts ]
+ LTSPREFIX=
+ ARCHEXT=i386
+ PROFILENAME=main-all-i386
+ [ i386 = i386 ]
+ [ ! -e /var/home/upgrade-tester/auto-upgrade-tester/profiles/main-all-i386 ]
+ PROFILENAME=main-all
+ echo Running profile main-all
Running profile main-all
+ python bin/auto-upgrade-tester /var/home/upgrade-tester/auto-upgrade-tester/profiles/main-all
Testing '/var/home/upgrade-tester/auto-upgrade-tester/profiles/main-all'
using ssh port: 54322
Port 5901 already in use. Skipping!
Port 5902 already in use. Skipping!
Port 5903 already in use. Skipping!
Port 5904 already in use. Skipping!
Port 5905 already in use. Skipping!
Port 5906 already in use. Skipping!
Port 5907 already in use. Skipping!
using VncNum: 5908
Storing the result in '/var/home/upgrade-tester/auto-upgrade-tester/result/main-all'
2013-03-08 17:07:59.371970 log started
bootstrap()
Not bootstrapping again, we have a cached BaseImage
upgrade()
Starting for upgrade
Starting ['kvm', '-hda', '/var/home/upgrade-tester/auto-upgrade-tester/test-image.main-all', '-monitor', 'stdio', '-localtime', '-no-reboot', '-net', 'nic,model=virtio', '-net', 'user', '-redir', 'tcp:54322::22', '-vnc', 'localhost:8', '-m', '3072']
qemu stopped unexpectedly with exit code '1'
FAILED: upgrade for '/var/home/upgrade-tester/auto-upgrade-tester/profiles/main-all'
Failed to upgrade /var/home/upgrade-tester/auto-upgrade-tester/profiles/main-all
Logs can be found here:
 /var/home/upgrade-tester/auto-upgrade-tester/result/main-all/bootstrap.log
 /var/home/upgrade-tester/auto-upgrade-tester/result/main-all/main.log
 /var/home/upgrade-tester/auto-upgrade-tester/result/main-all/apt.log
2013-03-08 17:20:04.959016 log ended.
Duration: 0:12:05.587046
Profile '/var/home/upgrade-tester/auto-upgrade-tester/profiles/main-all' FAILED
stop
stop pid:  <subprocess.Popen object at 0x18716d0>
waiting for qemu to shutdown
poll() returned
qemu stopped
Releasing lock: /var/lock/auto-upgrade-tester.54322.lock
Releasing lock: /var/lock/auto-upgrade-tester.5908.lock
+ cp -ar /var/home/upgrade-tester/auto-upgrade-tester/result/main-all/ <http://10.189.74.2:8080/job/precise-upgrade-oneiric-main/./ARCH=i386,LTS=non-lts,PROFILE=main-all,label=upgrade-test/ws/results>
Archiving artifacts
Recording test results
No test report files were found. Configuration error?
Build step 'Publish JUnit test result report' changed build result to FAILURE



More information about the ubuntu-testing-notifications mailing list