Build failed in Jenkins: raring-adt-python-scipy » i386,adt #3

Jenkins Notification devnull at canonical.com
Fri Mar 8 00:16:03 UTC 2013


See <http://10.189.74.2:8080/job/raring-adt-python-scipy/./ARCH=i386,label=adt/3/>

------------------------------------------
[...truncated 16267 lines...]
test_random (test_decomp_cholesky.TestCholesky) ... ok
test_random_complex (test_decomp_cholesky.TestCholesky) ... ok
test_simple (test_decomp_cholesky.TestCholesky) ... ok
test_simple_complex (test_decomp_cholesky.TestCholesky) ... ok
test_lower_complex (test_decomp_cholesky.TestCholeskyBanded) ... ok
test_lower_real (test_decomp_cholesky.TestCholeskyBanded) ... ok
test_upper_complex (test_decomp_cholesky.TestCholeskyBanded) ... ok
test_upper_real (test_decomp_cholesky.TestCholeskyBanded) ... ok
test_decomp_cholesky.TestOverwrite.test_cho_factor ... ok
test_decomp_cholesky.TestOverwrite.test_cho_solve ... ok
test_decomp_cholesky.TestOverwrite.test_cho_solve_banded ... ok
test_decomp_cholesky.TestOverwrite.test_cholesky ... ok
test_decomp_cholesky.TestOverwrite.test_cholesky_banded ... ok
test_default_a (test_fblas.TestCaxpy) ... ok
test_simple (test_fblas.TestCaxpy) ... ok
test_x_and_y_stride (test_fblas.TestCaxpy) ... ok
test_x_bad_size (test_fblas.TestCaxpy) ... ok
test_x_stride (test_fblas.TestCaxpy) ... ok
test_y_bad_size (test_fblas.TestCaxpy) ... ok
test_y_stride (test_fblas.TestCaxpy) ... ok
test_simple (test_fblas.TestCcopy) ... ok
test_x_and_y_stride (test_fblas.TestCcopy) ... ok
test_x_bad_size (test_fblas.TestCcopy) ... ok
test_x_stride (test_fblas.TestCcopy) ... ok
test_y_bad_size (test_fblas.TestCcopy) ... ok
test_y_stride (test_fblas.TestCcopy) ... ok
test_default_beta_y (test_fblas.TestCgemv) ... ok
test_simple (test_fblas.TestCgemv) ... ok
test_simple_transpose (test_fblas.TestCgemv) ... ok
test_simple_transpose_conj (test_fblas.TestCgemv) ... ok
test_x_stride (test_fblas.TestCgemv) ... ok
test_x_stride_assert (test_fblas.TestCgemv) ... ok
test_x_stride_transpose (test_fblas.TestCgemv) ... ok
test_y_stride (test_fblas.TestCgemv) ... ok
test_y_stride_assert (test_fblas.TestCgemv) ... ok
test_y_stride_transpose (test_fblas.TestCgemv) ... ok
test_simple (test_fblas.TestCscal) ... ok
test_x_bad_size (test_fblas.TestCscal) ... ok
test_x_stride (test_fblas.TestCscal) ... ok
test_simple (test_fblas.TestCswap) ... ok
test_x_and_y_stride (test_fblas.TestCswap) ... ok
test_x_bad_size (test_fblas.TestCswap) ... ok
test_x_stride (test_fblas.TestCswap) ... ok
test_y_bad_size (test_fblas.TestCswap) ... ok
test_y_stride (test_fblas.TestCswap) ... ok
test_default_a (test_fblas.TestDaxpy) ... ok
test_simple (test_fblas.TestDaxpy) ... ok
test_x_and_y_stride (test_fblas.TestDaxpy) ... ok
test_x_bad_size (test_fblas.TestDaxpy) ... ok
test_x_stride (test_fblas.TestDaxpy) ... ok
test_y_bad_size (test_fblas.TestDaxpy) ... ok
test_y_stride (test_fblas.TestDaxpy) ... ok
test_simple (test_fblas.TestDcopy) ... ok
test_x_and_y_stride (test_fblas.TestDcopy) ... ok
test_x_bad_size (test_fblas.TestDcopy) ... ok
test_x_stride (test_fblas.TestDcopy) ... ok
test_y_bad_size (test_fblas.TestDcopy) ... ok
test_y_stride (test_fblas.TestDcopy) ... ok
test_default_beta_y (test_fblas.TestDgemv) ... ok
test_simple (test_fblas.TestDgemv) ... ok
test_simple_transpose (test_fblas.TestDgemv) ... ok
test_simple_transpose_conj (test_fblas.TestDgemv) ... ok
test_x_stride (test_fblas.TestDgemv) ... ok
test_x_stride_assert (test_fblas.TestDgemv) ... ok
test_x_stride_transpose (test_fblas.TestDgemv) ... ok
test_y_stride (test_fblas.TestDgemv) ... ok
test_y_stride_assert (test_fblas.TestDgemv) ... ok
test_y_stride_transpose (test_fblas.TestDgemv) ... ok
test_simple (test_fblas.TestDscal) ... ok
test_x_bad_size (test_fblas.TestDscal) ... ok
test_x_stride (test_fblas.TestDscal) ... ok
test_simple (test_fblas.TestDswap) ... ok
test_x_and_y_stride (test_fblas.TestDswap) ... ok
test_x_bad_size (test_fblas.TestDswap) ... ok
test_x_stride (test_fblas.TestDswap) ... ok
test_y_bad_size (test_fblas.TestDswap) ... ok
test_y_stride (test_fblas.TestDswap) ... ok
test_default_a (test_fblas.TestSaxpy) ... ok
test_simple (test_fblas.TestSaxpy) ... ok
test_x_and_y_stride (test_fblas.TestSaxpy) ... ok
test_x_bad_size (test_fblas.TestSaxpy) ... ok
test_x_stride (test_fblas.TestSaxpy) ... ok
test_y_bad_size (test_fblas.TestSaxpy) ... ok
test_y_stride (test_fblas.TestSaxpy) ... ok
test_simple (test_fblas.TestScopy) ... ok
test_x_and_y_stride (test_fblas.TestScopy) ... ok
test_x_bad_size (test_fblas.TestScopy) ... ok
test_x_stride (test_fblas.TestScopy) ... ok
test_y_bad_size (test_fblas.TestScopy) ... ok
test_y_stride (test_fblas.TestScopy) ... ok
test_default_beta_y (test_fblas.TestSgemv) ... ok
test_simple (test_fblas.TestSgemv) ... ok
test_simple_transpose (test_fblas.TestSgemv) ... ok
test_simple_transpose_conj (test_fblas.TestSgemv) ... ok
test_x_stride (test_fblas.TestSgemv) ... ok
test_x_stride_assert (test_fblas.TestSgemv) ... ok
test_x_stride_transpose (test_fblas.TestSgemv) ... ok
test_y_stride (test_fblas.TestSgemv) ... ok
test_y_stride_assert (test_fblas.TestSgemv) ... ok
test_y_stride_transpose (test_fblas.TestSgemv) ... ok
test_simple (test_fblas.TestSscal) ... ok
test_x_bad_size (test_fblas.TestSscal) ... ok
test_x_stride (test_fblas.TestSscal) ... ok
test_simple (test_fblas.TestSswap) ... ok
test_x_and_y_stride (test_fblas.TestSswap) ... ok
test_x_bad_size (test_fblas.TestSswap) ... ok
test_x_stride (test_fblas.TestSswap) ... ok
test_y_bad_size (test_fblas.TestSswap) ... ok
test_y_stride (test_fblas.TestSswap) ... ok
test_default_a (test_fblas.TestZaxpy) ... ok
test_simple (test_fblas.TestZaxpy) ... ok
test_x_and_y_stride (test_fblas.TestZaxpy) ... ok
test_x_bad_size (test_fblas.TestZaxpy) ... ok
test_x_stride (test_fblas.TestZaxpy) ... ok
test_y_bad_size (test_fblas.TestZaxpy) ... ok
test_y_stride (test_fblas.TestZaxpy) ... ok
test_simple (test_fblas.TestZcopy) ... ok
test_x_and_y_stride (test_fblas.TestZcopy) ... ok
test_x_bad_size (test_fblas.TestZcopy) ... ok
test_x_stride (test_fblas.TestZcopy) ... ok
test_y_bad_size (test_fblas.TestZcopy) ... ok
test_y_stride (test_fblas.TestZcopy) ... ok
test_default_beta_y (test_fblas.TestZgemv) ... ok
test_simple (test_fblas.TestZgemv) ... ok
test_simple_transpose (test_fblas.TestZgemv) ... ok
test_simple_transpose_conj (test_fblas.TestZgemv) ... ok
test_x_stride (test_fblas.TestZgemv) ... ok
test_x_stride_assert (test_fblas.TestZgemv) ... ok
test_x_stride_transpose (test_fblas.TestZgemv) ... ok
test_y_stride (test_fblas.TestZgemv) ... ok
test_y_stride_assert (test_fblas.TestZgemv) ... ok
test_y_stride_transpose (test_fblas.TestZgemv) ... ok
test_simple (test_fblas.TestZscal) ... ok
test_x_bad_size (test_fblas.TestZscal) ... ok
test_x_stride (test_fblas.TestZscal) ... ok
test_simple (test_fblas.TestZswap) ... ok
test_x_and_y_stride (test_fblas.TestZswap) ... ok
test_x_bad_size (test_fblas.TestZswap) ... ok
test_x_stride (test_fblas.TestZswap) ... ok
test_y_bad_size (test_fblas.TestZswap) ... ok
test_y_stride (test_fblas.TestZswap) ... ok
test_cases (test_solvers.TestSolveContinuousARE) ... ok
test_cases (test_solvers.TestSolveDiscreteARE) ... ok
test_cases (test_solvers.TestSolveLyapunov) ... ok
test_cases (test_solvers.TestSolveSylvester) ... ok
test_trivial (test_solvers.TestSolveSylvester) ... ok
test_special_matrices.TestBlockDiag.test_bad_arg ... ok
test_special_matrices.TestBlockDiag.test_basic ... ok
test_special_matrices.TestBlockDiag.test_dtype ... ok
test_special_matrices.TestBlockDiag.test_no_args ... ok
test_special_matrices.TestBlockDiag.test_scalar_and_1d_args ... ok
test_basic (test_special_matrices.TestCirculant) ... ok
test_bad_shapes (test_special_matrices.TestCompanion) ... ok
test_basic (test_special_matrices.TestCompanion) ... ok
test_basic (test_special_matrices.TestHadamard) ... ok
test_basic (test_special_matrices.TestHankel) ... ok
test_basic (test_special_matrices.TestHilbert) ... ok
test_basic (test_special_matrices.TestInvHilbert) ... ok
test_inverse (test_special_matrices.TestInvHilbert) ... ok
test_special_matrices.TestKron.test_basic ... ok
test_bad_shapes (test_special_matrices.TestLeslie) ... ok
test_basic (test_special_matrices.TestLeslie) ... ok
test_big (test_special_matrices.TestPascal) ... ok
test_cases (test_special_matrices.TestPascal) ... ok
test_basic (test_special_matrices.TestToeplitz) ... ok
test_complex_01 (test_special_matrices.TestToeplitz) ... ok
Scalar arguments still produce a 2D array. ... ok
test_scalar_01 (test_special_matrices.TestToeplitz) ... ok
test_scalar_02 (test_special_matrices.TestToeplitz) ... ok
test_scalar_03 (test_special_matrices.TestToeplitz) ... ok
test_scalar_04 (test_special_matrices.TestToeplitz) ... ok
test_2d (test_special_matrices.TestTri) ... ok
test_basic (test_special_matrices.TestTri) ... ok
test_diag (test_special_matrices.TestTri) ... ok
test_diag2d (test_special_matrices.TestTri) ... ok
test_basic (test_special_matrices.TestTril) ... ok
test_diag (test_special_matrices.TestTril) ... ok
test_basic (test_special_matrices.TestTriu) ... ok
test_diag (test_special_matrices.TestTriu) ... ok

======================================================================
FAIL: Test singular pair
----------------------------------------------------------------------
Traceback (most recent call last):
  File "/usr/lib/python2.7/dist-packages/nose/case.py", line 197, in runTest
    self.test(*self.arg)
  File "/usr/lib/python2.7/dist-packages/numpy/testing/decorators.py", line 215, in knownfailer
    return f(*args, **kwargs)
  File "/usr/lib/python2.7/dist-packages/scipy/linalg/tests/test_decomp.py", line 204, in test_singular
    self._check_gen_eig(A, B)
  File "/usr/lib/python2.7/dist-packages/scipy/linalg/tests/test_decomp.py", line 190, in _check_gen_eig
    err_msg=msg)
  File "/usr/lib/python2.7/dist-packages/numpy/testing/utils.py", line 812, in assert_array_almost_equal
    header=('Arrays are not almost equal to %d decimals' % decimal))
  File "/usr/lib/python2.7/dist-packages/numpy/testing/utils.py", line 645, in assert_array_compare
    raise AssertionError(msg)
AssertionError: 
Arrays are not almost equal to 6 decimals

array([[22, 34, 31, 31, 17],
       [45, 45, 42, 19, 29],
       [39, 47, 49, 26, 34],
       [27, 31, 26, 21, 15],
       [38, 44, 44, 24, 30]])
array([[13, 26, 25, 17, 24],
       [31, 46, 40, 26, 37],
       [26, 40, 19, 25, 25],
       [16, 25, 27, 14, 23],
       [24, 35, 18, 21, 22]])
(mismatch 25.0%)
 x: array([ -3.63672429e-01 +0.00000000e+00j,
        -1.72783306e-15 -3.75494248e-08j,
        -1.72783306e-15 +3.75494248e-08j,   2.00000000e+00 +0.00000000e+00j])
 y: array([ -3.54612164e-01 +0.00000000e+00j,
         9.81028930e-16 -4.30773848e-08j,
         9.81028930e-16 +4.30773848e-08j,   2.00000000e+00 +0.00000000e+00j])

----------------------------------------------------------------------
Ran 466 tests in 2.112s

FAILED (KNOWNFAIL=1, failures=1)
Running unit tests for scipy.linalg
NumPy version 1.7.0
NumPy is installed in /usr/lib/python2.7/dist-packages/numpy
SciPy version 0.11.0
SciPy is installed in /usr/lib/python2.7/dist-packages/scipy
Python version 2.7.3 (default, Jan 26 2013, 15:27:56) [GCC 4.7.2]
nose version 1.1.2
test_decomp.TestEig.test_singular
#errors: 1
Traceback (most recent call last):
  File "runtest.py", line 21, in <module>
    assert len(errors) == 0
AssertionError
adt-run: trace: & dsc0t-atlas: ----------------------------------------]
adt-run: trace1: ** needs_reset, previously=False
adt-run: trace: @@@@@@@@@@@@@@@@@@@@@@@@@@@@@@@@@@@@@@@@ tests done.
adt-run: trace: ** stop
adt-run: trace: ** close, scratch=tb-scratch~/tmp/tmp.rAezRFeFTM:-/|/tmp/tmp.rAezRFeFTM/!
2013-03-08 00:10:28: Failure: adt-run exited with status 4.
Pseudo-terminal will not be allocated because stdin is not a terminal.
Warning: Permanently added '[localhost]:54325' (ECDSA) to the list of known hosts.
2013-03-08 00:10:30: Info: Test artifacts copied to <http://10.189.74.2:8080/job/raring-adt-python-scipy/./ARCH=i386,label=adt/ws/results>
2013-03-08 00:10:30: Info: Updating Jenkins results
Pseudo-terminal will not be allocated because stdin is not a terminal.
Warning: Permanently added '[localhost]:54325' (ECDSA) to the list of known hosts.
2013-03-08 00:10:31: Info: Cleaning up
Build step 'Execute shell' marked build as failure
Archiving artifacts



More information about the ubuntu-testing-notifications mailing list