Build failed in Jenkins: raring-adt-oneconf » amd64,adt #19

Jenkins Notification devnull at canonical.com
Wed Feb 27 00:17:10 UTC 2013


See <http://10.189.74.2:8080/job/raring-adt-oneconf/./ARCH=amd64,label=adt/19/>

------------------------------------------
[...truncated 1491 lines...]
CRITICAL:__main__:Can't connect to dbus: org.freedesktop.DBus.Error.NotSupported: Unable to autolaunch a dbus-daemon without a $DISPLAY for X11, fallback to direct connexion as a fallback:
WARNING:oneconf.hosts:Error in loading other_hosts file: [Errno 2] No such file or directory: '/tmp/oneconf-test/cache/0000/other_hosts'
CRITICAL:__main__:org.freedesktop.DBus.Error.NotSupported: Unable to autolaunch a dbus-daemon without a $DISPLAY for X11
CRITICAL:__main__:Can't connect to dbus: org.freedesktop.DBus.Error.NotSupported: Unable to autolaunch a dbus-daemon without a $DISPLAY for X11, fallback to direct connexion as a fallback:
CRITICAL:__main__:org.freedesktop.DBus.Error.NotSupported: Unable to autolaunch a dbus-daemon without a $DISPLAY for X11
CRITICAL:__main__:org.freedesktop.DBus.Error.NotSupported: Unable to autolaunch a dbus-daemon without a $DISPLAY for X11
CRITICAL:__main__:org.freedesktop.DBus.Error.NotSupported: Unable to autolaunch a dbus-daemon without a $DISPLAY for X11
/usr/lib/python3.3/distutils/dist.py:257: UserWarning: Unknown distribution option: 'test_requires'
  warnings.warn(msg)
======================================================================
ERROR: Test that the daemon is kept alive if you have activity
----------------------------------------------------------------------
Traceback (most recent call last):
  File "/tmp/tmp.DHOicQxiMT/dsc0-build/oneconf-0.3.3/test/test_daemon.py", line 67, in tearDown
    self.dbus_service_process.terminate()
  File "/usr/lib/python3.3/subprocess.py", line 1750, in terminate
    self.send_signal(signal.SIGTERM)
  File "/usr/lib/python3.3/subprocess.py", line 1745, in send_signal
    os.kill(self.pid, sig)
ProcessLookupError: [Errno 3] No such process
-------------------- >> begin captured logging << --------------------
oneconf.distributor: DEBUG: get_distro: 'Test'
--------------------- >> end captured logging << ---------------------

======================================================================
ERROR: Test that the daemon effectively stops after a timeout
----------------------------------------------------------------------
Traceback (most recent call last):
  File "/tmp/tmp.DHOicQxiMT/dsc0-build/oneconf-0.3.3/test/test_daemon.py", line 67, in tearDown
    self.dbus_service_process.terminate()
  File "/usr/lib/python3.3/subprocess.py", line 1750, in terminate
    self.send_signal(signal.SIGTERM)
  File "/usr/lib/python3.3/subprocess.py", line 1745, in send_signal
    os.kill(self.pid, sig)
ProcessLookupError: [Errno 3] No such process

======================================================================
ERROR: Test that the daemon doesn't crash in case of invalid setup
----------------------------------------------------------------------
Traceback (most recent call last):
  File "/tmp/tmp.DHOicQxiMT/dsc0-build/oneconf-0.3.3/test/test_daemon.py", line 150, in test_no_daemon_crash_if_invalid_setup
    oneconf = dbusconnect.DbusConnect()
  File "/tmp/tmp.DHOicQxiMT/dsc0-build/oneconf-0.3.3/oneconf/dbusconnect.py", line 150, in __init__
    self.bus = dbus.SessionBus()
  File "/usr/lib/python3/dist-packages/dbus/_dbus.py", line 211, in __new__
    mainloop=mainloop)
  File "/usr/lib/python3/dist-packages/dbus/_dbus.py", line 100, in __new__
    bus = BusConnection.__new__(subclass, bus_type, mainloop=mainloop)
  File "/usr/lib/python3/dist-packages/dbus/bus.py", line 122, in __new__
    bus = cls._new_for_bus(address_or_type, mainloop=mainloop)
dbus.exceptions.DBusException: org.freedesktop.DBus.Error.NotSupported: Unable to autolaunch a dbus-daemon without a $DISPLAY for X11

======================================================================
FAIL: Test that the daemon is kept alive if you have activity
----------------------------------------------------------------------
Traceback (most recent call last):
  File "/tmp/tmp.DHOicQxiMT/dsc0-build/oneconf-0.3.3/test/test_daemon.py", line 136, in test_daemon_keep_alive_if_activity
    self.assertTrue(time_stop - self.time_start > 2*MIN_TIME_WITHOUT_ACTIVITY)
AssertionError: False is not true
-------------------- >> begin captured logging << --------------------
oneconf.distributor: DEBUG: get_distro: 'Test'
--------------------- >> end captured logging << ---------------------

======================================================================
FAIL: Test that the daemon effectively stops after a timeout
----------------------------------------------------------------------
Traceback (most recent call last):
  File "/tmp/tmp.DHOicQxiMT/dsc0-build/oneconf-0.3.3/test/test_daemon.py", line 124, in test_daemon_stop_after_timeout
    self.assertTrue(time_stop - self.time_start > MIN_TIME_WITHOUT_ACTIVITY)
AssertionError: False is not true

----------------------------------------------------------------------
Ran 78 tests in 449.010s

FAILED (errors=3, failures=2)
adt-run: trace: & dsc0t-unittests:  - - - - - - - - - - stdout - - - - - - - - - -
running nosetests
running egg_info
writing dependency_links to oneconf.egg-info/dependency_links.txt
writing top-level names to oneconf.egg-info/top_level.txt
writing oneconf.egg-info/PKG-INFO
reading manifest file 'oneconf.egg-info/SOURCES.txt'
writing manifest file 'oneconf.egg-info/SOURCES.txt'
running build_ext
Listing this host stored in OneConf:
ID: 0000 [Current]
 name: foomachine
 share inventory: False
Listing this host stored in OneConf:
ID: 0000 [Current]
 name: foomachine
 share inventory: False
Nothing done: in direct mode, there is no communication with the service
oneconf-query can't run as root. Exiting
oneconf-service can't run as root. Exiting
oneconf-query can't run as root. Exiting
oneconf-service can't run as root. Exiting
adt-run: trace: & dsc0t-unittests: ----------------------------------------]
adt-run: trace1: ** needs_reset, previously=False
adt-run: trace: & dsc0t-version: preparing
adt-run: trace: & dsc0t-version:  processing dependency @
adt-run: trace: & dsc0t-version:   synthesised dependency oneconf-common
adt-run: trace: & dsc0t-version:   synthesised dependency python-oneconf
adt-run: trace: & dsc0t-version:   synthesised dependency python3-oneconf
adt-run: trace: & dsc0t-version:   synthesised dependency oneconf
adt-run: trace1: ** prepare1, modified=True, deps_processed=[u'oneconf-common', u'python-oneconf', u'python3-oneconf', u'oneconf', u'xvfb', u'python3-nose', u'python3-mock'], deps_new=[u'oneconf-common', u'python-oneconf', u'python3-oneconf', u'oneconf']
adt-run: trace1: ** prepare2, deps_new=[u'oneconf-common', u'python-oneconf', u'python3-oneconf', u'oneconf']
adt-run: trace: * publish
adt-run: trace: $ ftparchive: sh -ec <SCRIPT> x /home/ubuntu/adt-log//binaries /home/ubuntu/.autopkgtest/gpg
adt-run: trace1: $     
adt-run: trace1: $       exec >&2
adt-run: trace1: $       cd "$1"
adt-run: trace1: $       apt-ftparchive packages . >Packages
adt-run: trace1: $       gzip <Packages >Packages.gz
adt-run: trace1: $       apt-ftparchive release . >Release
adt-run: trace1: $       rm -f Release.gpg
adt-run: trace1: $       gpg --homedir="$2" --batch --detach-sign --armour -o Release.gpg Release
adt-run: trace1: $       gpg --homedir="$2" --batch --export >archive-key.pgp
adt-run: trace1: $     		
adt-run: trace: $ apt-key: sh -ec <SCRIPT>
adt-run: trace1: $     
adt-run: trace1: $       exec 3>&1 >&2
adt-run: trace1: $       apt-key add archive-key.pgp
adt-run: trace1: $       echo "deb file:///tmp/tmp.DHOicQxiMT/binaries/ /" >/etc/apt/sources.list.d/autopkgtest.list
adt-run: trace1: $       if [ "x`ls /var/lib/dpkg/updates`" != x ]; then
adt-run: trace1: $         echo >&2 "/var/lib/dpkg/updates contains some files, aargh"; exit 1
adt-run: trace1: $       fi
adt-run: trace1: $       apt-get -q -o quiet=true -o APT::Get::Assume-Yes=true -o Debug::pkgProblemResolver=true -o APT::Get::force-yes=true update >&2
adt-run: trace1: $       cat /var/lib/dpkg/status >&3
adt-run: trace1: $     		
OK
Ign file:  InRelease
Get:1 file:  Release.gpg [198 B]
Get:2 file:  Release [1,202 B]
Ign file:  Translation-en_US
Ign file:  Translation-en
Ign http://security.ubuntu.com raring-security InRelease
Ign http://archive.ubuntu.com raring InRelease
Hit http://security.ubuntu.com raring-security Release.gpg
Ign http://archive.ubuntu.com raring-updates InRelease
Hit http://security.ubuntu.com raring-security Release
Ign http://archive.ubuntu.com raring-proposed InRelease
Hit http://security.ubuntu.com raring-security/main Sources
Get:3 http://archive.ubuntu.com raring Release.gpg [933 B]
Hit http://security.ubuntu.com raring-security/universe Sources
Hit http://archive.ubuntu.com raring-updates Release.gpg
Hit http://security.ubuntu.com raring-security/main amd64 Packages
Get:4 http://archive.ubuntu.com raring-proposed Release.gpg [933 B]
Hit http://security.ubuntu.com raring-security/universe amd64 Packages
Get:5 http://archive.ubuntu.com raring Release [40.8 kB]
Hit http://security.ubuntu.com raring-security/main Translation-en
Hit http://security.ubuntu.com raring-security/universe Translation-en
Hit http://archive.ubuntu.com raring-updates Release
Get:6 http://archive.ubuntu.com raring-proposed Release [40.8 kB]
Get:7 http://archive.ubuntu.com raring/main Sources [889 kB]
Ign http://security.ubuntu.com raring-security/main Translation-en_US
Ign http://security.ubuntu.com raring-security/universe Translation-en_US
Get:8 http://archive.ubuntu.com raring/universe Sources [5,686 kB]
Get:9 http://archive.ubuntu.com raring/restricted Sources [6,291 B]
Get:10 http://archive.ubuntu.com raring/multiverse Sources [167 kB]
Get:11 http://archive.ubuntu.com raring/main amd64 Packages [1,170 kB]
Get:12 http://archive.ubuntu.com raring/universe amd64 Packages [5,418 kB]
Get:13 http://archive.ubuntu.com raring/restricted amd64 Packages [9,921 B]
Get:14 http://archive.ubuntu.com raring/multiverse amd64 Packages [129 kB]
Hit http://archive.ubuntu.com raring/main Translation-en
Hit http://archive.ubuntu.com raring/multiverse Translation-en
Hit http://archive.ubuntu.com raring/restricted Translation-en
Hit http://archive.ubuntu.com raring/universe Translation-en
Hit http://archive.ubuntu.com raring-updates/main Sources
Hit http://archive.ubuntu.com raring-updates/universe Sources
Hit http://archive.ubuntu.com raring-updates/main amd64 Packages
Hit http://archive.ubuntu.com raring-updates/universe amd64 Packages
Hit http://archive.ubuntu.com raring-updates/main Translation-en
Hit http://archive.ubuntu.com raring-updates/universe Translation-en
Get:15 http://archive.ubuntu.com raring-proposed/main Sources [15.9 kB]
Get:16 http://archive.ubuntu.com raring-proposed/restricted Sources [14 B]
Get:17 http://archive.ubuntu.com raring-proposed/universe Sources [171 kB]
Get:18 http://archive.ubuntu.com raring-proposed/multiverse Sources [1,742 B]
Get:19 http://archive.ubuntu.com raring-proposed/restricted amd64 Packages [14 B]
Get:20 http://archive.ubuntu.com raring-proposed/main amd64 Packages [43.9 kB]
Get:21 http://archive.ubuntu.com raring-proposed/multiverse amd64 Packages [1,846 B]
Get:22 http://archive.ubuntu.com raring-proposed/universe amd64 Packages [228 kB]
Hit http://archive.ubuntu.com raring-proposed/main Translation-en
Hit http://archive.ubuntu.com raring-proposed/multiverse Translation-en
Hit http://archive.ubuntu.com raring-proposed/restricted Translation-en
Hit http://archive.ubuntu.com raring-proposed/universe Translation-en
Ign http://archive.ubuntu.com raring/main Translation-en_US
Ign http://archive.ubuntu.com raring/multiverse Translation-en_US
Ign http://archive.ubuntu.com raring/restricted Translation-en_US
Ign http://archive.ubuntu.com raring/universe Translation-en_US
Ign http://archive.ubuntu.com raring-updates/main Translation-en_US
Ign http://archive.ubuntu.com raring-updates/universe Translation-en_US
Ign http://archive.ubuntu.com raring-proposed/main Translation-en_US
Ign http://archive.ubuntu.com raring-proposed/multiverse Translation-en_US
Ign http://archive.ubuntu.com raring-proposed/restricted Translation-en_US
Ign http://archive.ubuntu.com raring-proposed/universe Translation-en_US
Fetched 14.0 MB in 12s (1,092 kB/s)
Reading package lists...
adt-run: trace: * publish reinstall checking...
adt-run: trace: * publish install...
adt-run: trace: * publish done
adt-run: trace1: **  installing dependencies [u'oneconf-common', u'python-oneconf', u'python3-oneconf', u'oneconf']
adt-run: trace: dependencies: install-deps: satisfying oneconf-common, python-oneconf, python3-oneconf, oneconf
adt-run: trace: dependencies: install-deps: running ['/usr/lib/pbuilder/pbuilder-satisfydepends-classic', '--binary-all', '--internal-chrootexec', '/home/ubuntu/adt-log//satdep-auxverb', '-c', '/home/ubuntu/adt-log//deps.dsc']
 -> Attempting to parse the build-deps 
 -> Considering build-dep oneconf-common
   -> Trying oneconf-common
 -> Considering build-dep python-oneconf
   -> Trying python-oneconf
 -> Considering build-dep python3-oneconf
   -> Trying python3-oneconf
 -> Considering build-dep oneconf
   -> Trying oneconf
 -> Installing  oneconf-common python-oneconf python3-oneconf oneconf
Reading package lists...
Building dependency tree...
Reading state information...
oneconf is already the newest version.
oneconf-common is already the newest version.
python-oneconf is already the newest version.
python3-oneconf is already the newest version.
0 upgraded, 0 newly installed, 0 to remove and 5 not upgraded.
 -> Finished parsing the build-deps
adt-run: trace: & dsc0t-version: [----------------------------------------
+ buildtree=/tmp/tmp.DHOicQxiMT/dsc0-build/oneconf-0.3.3/
+ shift
+ rm -rf -- /tmp/tmp.DHOicQxiMT/dsc0t-version-testtmp /tmp/tmp.DHOicQxiMT/dsc0t-version-testtmp/tmpdir /tmp/tmp.DHOicQxiMT/dsc0t-version-testtmp/adttmp
+ mkdir -- /tmp/tmp.DHOicQxiMT/dsc0t-version-testtmp /tmp/tmp.DHOicQxiMT/dsc0t-version-testtmp/tmpdir /tmp/tmp.DHOicQxiMT/dsc0t-version-testtmp/adttmp
+ chown ubuntu /tmp/tmp.DHOicQxiMT/dsc0t-version-testtmp /tmp/tmp.DHOicQxiMT/dsc0t-version-testtmp/tmpdir /tmp/tmp.DHOicQxiMT/dsc0t-version-testtmp/adttmp
adt-run: trace: & dsc0t-version:  - - - - - - - - - - results - - - - - - - - - -
dsc0t-version        PASS
adt-run: trace: & dsc0t-version:  - - - - - - - - - - stdout - - - - - - - - - -
oneconf-query 0.3.3
adt-run: trace: & dsc0t-version: ----------------------------------------]
adt-run: trace1: ** needs_reset, previously=False
adt-run: trace: @@@@@@@@@@@@@@@@@@@@@@@@@@@@@@@@@@@@@@@@ tests done.
adt-run: trace: ** stop
adt-run: trace: ** close, scratch=tb-scratch~/tmp/tmp.DHOicQxiMT:-/|/tmp/tmp.DHOicQxiMT/!
2013-02-27 12:17:06 AM: Failure: adt-run exited with status 4.
Pseudo-terminal will not be allocated because stdin is not a terminal.
Warning: Permanently added '[localhost]:54327' (ECDSA) to the list of known hosts.
find: `./.autopkgtest/gpg': Permission denied
2013-02-27 12:17:09 AM: Info: Test artifacts copied to <http://10.189.74.2:8080/job/raring-adt-oneconf/./ARCH=amd64,label=adt/ws/results>
2013-02-27 12:17:09 AM: Info: Updating Jenkins results
Pseudo-terminal will not be allocated because stdin is not a terminal.
Warning: Permanently added '[localhost]:54327' (ECDSA) to the list of known hosts.
2013-02-27 12:17:10 AM: Info: Cleaning up
Build step 'Execute shell' marked build as failure
Archiving artifacts



More information about the ubuntu-testing-notifications mailing list