Build failed in Jenkins: raring-adt-network-manager » amd64,adt #51

Jenkins Notification devnull at canonical.com
Fri Jan 18 22:13:27 UTC 2013


See <http://10.189.74.2:8080/job/raring-adt-network-manager/./ARCH=amd64,label=adt/51/>

------------------------------------------
[...truncated 647 lines...]
Setting up libproxy1:amd64 (0.4.11-0ubuntu1) ...
Setting up glib-networking-common (2.34.2-0ubuntu1) ...
Setting up glib-networking-services (2.34.2-0ubuntu1) ...
Setting up dconf-service (0.14.1-0ubuntu1) ...
Setting up dconf-gsettings-backend:amd64 (0.14.1-0ubuntu1) ...
Setting up gsettings-desktop-schemas (3.6.1-0ubuntu1) ...
Setting up glib-networking:amd64 (2.34.2-0ubuntu1) ...
Setting up libsoup2.4-1:amd64 (2.40.3-0ubuntu1) ...
Setting up libsysfs2:amd64 (2.1.0+repack-2) ...
Setting up libnm-util2 (0.9.6.0+git201301021750.e78c3e8-0ubuntu2) ...
Setting up libnm-glib4 (0.9.6.0+git201301021750.e78c3e8-0ubuntu2) ...
Setting up libnetfilter-conntrack3:amd64 (1.0.1-1) ...
Setting up dnsmasq-base (2.65-1) ...
Setting up iputils-arping (3:20101006-3ubuntu1) ...
Setting up network-manager (0.9.6.0+git201301021750.e78c3e8-0ubuntu2) ...
Setting up gir1.2-freedesktop (1.35.4-0ubuntu3) ...
Setting up gir1.2-networkmanager-1.0 (0.9.6.0+git201301021750.e78c3e8-0ubuntu2) ...
Setting up python3-pkg-resources (0.6.34-0ubuntu1) ...
Setting up python3-defer (1.0.6-2) ...
Setting up python3-aptdaemon (0.45+bzr883-0ubuntu1) ...
Setting up python3-aptdaemon.test (0.45+bzr883-0ubuntu1) ...
Processing triggers for libc-bin ...
ldconfig deferred processing now taking place
Processing triggers for ureadahead ...
 -> Finished parsing the build-deps
adt-run: trace: & dsc0t-nm: [----------------------------------------
+ buildtree=/tmp/tmp.2LpiuRMCPS/dsc0-build/network-manager-0.9.6.0+git201301021750.e78c3e8/
+ shift
+ rm -rf -- /tmp/tmp.2LpiuRMCPS/dsc0t-nm-testtmp /tmp/tmp.2LpiuRMCPS/dsc0t-nm-testtmp/tmpdir /tmp/tmp.2LpiuRMCPS/dsc0t-nm-testtmp/adttmp
+ mkdir -- /tmp/tmp.2LpiuRMCPS/dsc0t-nm-testtmp /tmp/tmp.2LpiuRMCPS/dsc0t-nm-testtmp/tmpdir /tmp/tmp.2LpiuRMCPS/dsc0t-nm-testtmp/adttmp
adt-run: trace: & dsc0t-nm:  - - - - - - - - - - results - - - - - - - - - -
dsc0t-nm             PASS
adt-run: trace: & dsc0t-nm:  - - - - - - - - - - stdout - - - - - - - - - -
Auto interfaces found: lo eth0
iface to disable = eth0
Disabling interface: eth0 ... done.
Entering main event loop
Connected to the system bus
Registering null backend at priority -10
Using authority class PolkitBackendLocalAuthority
Acquired the name org.freedesktop.PolicyKit1
testDevicesMACAddressMatch (__main__.TestNM) ... 
Checking eth0
ok
testNMVersion (__main__.TestNM) ... NetworkManager version is 0.9.7.0
ok

----------------------------------------------------------------------
Ran 2 tests in 1.286s

OK
adt-run: trace: & dsc0t-nm: ----------------------------------------]
adt-run: trace: & dsc0t-dnsmasq: preparing
adt-run: trace: & dsc0t-dnsmasq:  processing dependency python3
adt-run: trace: & dsc0t-dnsmasq:   literal dependency python3
adt-run: trace: & dsc0t-dnsmasq:  processing dependency python3-aptdaemon.test
adt-run: trace: & dsc0t-dnsmasq:   literal dependency python3-aptdaemon.test
adt-run: trace: & dsc0t-dnsmasq:  processing dependency python3-gi
adt-run: trace: & dsc0t-dnsmasq:   literal dependency python3-gi
adt-run: trace: & dsc0t-dnsmasq:  processing dependency network-manager
adt-run: trace: & dsc0t-dnsmasq:   literal dependency network-manager
adt-run: trace: & dsc0t-dnsmasq:  processing dependency gir1.2-networkmanager-1.0
adt-run: trace: & dsc0t-dnsmasq:   literal dependency gir1.2-networkmanager-1.0
adt-run: trace1: ** prepare1, modified=False, deps_processed=[u'python3', u'python3-aptdaemon.test', u'python3-gi', u'network-manager', u'gir1.2-networkmanager-1.0'], deps_new=[u'python3', u'python3-aptdaemon.test', u'python3-gi', u'network-manager', u'gir1.2-networkmanager-1.0']
adt-run: trace1: ** prepare2, deps_new=[u'python3', u'python3-aptdaemon.test', u'python3-gi', u'network-manager', u'gir1.2-networkmanager-1.0']
adt-run: trace: * publish
adt-run: trace: $ ftparchive: sh -ec <SCRIPT> x /home/ubuntu/adt-log//binaries /home/ubuntu/.autopkgtest/gpg
adt-run: trace1: $     
adt-run: trace1: $       exec >&2
adt-run: trace1: $       cd "$1"
adt-run: trace1: $       apt-ftparchive packages . >Packages
adt-run: trace1: $       gzip <Packages >Packages.gz
adt-run: trace1: $       apt-ftparchive release . >Release
adt-run: trace1: $       rm -f Release.gpg
adt-run: trace1: $       gpg --homedir="$2" --batch --detach-sign --armour -o Release.gpg Release
adt-run: trace1: $       gpg --homedir="$2" --batch --export >archive-key.pgp
adt-run: trace1: $     		
adt-run: trace: $ apt-key: sh -ec <SCRIPT>
adt-run: trace1: $     
adt-run: trace1: $       exec 3>&1 >&2
adt-run: trace1: $       apt-key add archive-key.pgp
adt-run: trace1: $       echo "deb file:///tmp/tmp.2LpiuRMCPS/binaries/ /" >/etc/apt/sources.list.d/autopkgtest.list
adt-run: trace1: $       if [ "x`ls /var/lib/dpkg/updates`" != x ]; then
adt-run: trace1: $         echo >&2 "/var/lib/dpkg/updates contains some files, aargh"; exit 1
adt-run: trace1: $       fi
adt-run: trace1: $       apt-get -q -o quiet=true -o APT::Get::Assume-Yes=true -o Debug::pkgProblemResolver=true -o APT::Get::force-yes=true update >&2
adt-run: trace1: $       cat /var/lib/dpkg/status >&3
adt-run: trace1: $     		
OK
Ign file:  InRelease
Get:1 file:  Release.gpg [198 B]
Get:2 file:  Release [1,202 B]
Ign file:  Translation-en_US
Ign file:  Translation-en
Ign http://security.ubuntu.com raring-security InRelease
Ign http://archive.ubuntu.com raring InRelease
Hit http://security.ubuntu.com raring-security Release.gpg
Ign http://archive.ubuntu.com raring-updates InRelease
Hit http://security.ubuntu.com raring-security Release
Ign http://archive.ubuntu.com raring-proposed InRelease
Hit http://archive.ubuntu.com raring Release.gpg
Hit http://security.ubuntu.com raring-security/main Sources
Hit http://archive.ubuntu.com raring-updates Release.gpg
Hit http://security.ubuntu.com raring-security/universe Sources
Hit http://archive.ubuntu.com raring-proposed Release.gpg
Hit http://security.ubuntu.com raring-security/main amd64 Packages
Hit http://archive.ubuntu.com raring Release
Hit http://security.ubuntu.com raring-security/universe amd64 Packages
Hit http://archive.ubuntu.com raring-updates Release
Hit http://archive.ubuntu.com raring-proposed Release
Hit http://security.ubuntu.com raring-security/main Translation-en
Hit http://archive.ubuntu.com raring/main Sources
Hit http://archive.ubuntu.com raring/universe Sources
Hit http://security.ubuntu.com raring-security/universe Translation-en
Hit http://archive.ubuntu.com raring/restricted Sources
Hit http://archive.ubuntu.com raring/multiverse Sources
Hit http://archive.ubuntu.com raring/main amd64 Packages
Hit http://archive.ubuntu.com raring/universe amd64 Packages
Hit http://archive.ubuntu.com raring/restricted amd64 Packages
Hit http://archive.ubuntu.com raring/multiverse amd64 Packages
Ign http://security.ubuntu.com raring-security/main Translation-en_US
Hit http://archive.ubuntu.com raring/main Translation-en
Ign http://security.ubuntu.com raring-security/universe Translation-en_US
Hit http://archive.ubuntu.com raring/multiverse Translation-en
Hit http://archive.ubuntu.com raring/restricted Translation-en
Hit http://archive.ubuntu.com raring/universe Translation-en
Hit http://archive.ubuntu.com raring-updates/main Sources
Hit http://archive.ubuntu.com raring-updates/universe Sources
Hit http://archive.ubuntu.com raring-updates/main amd64 Packages
Hit http://archive.ubuntu.com raring-updates/universe amd64 Packages
Hit http://archive.ubuntu.com raring-updates/main Translation-en
Hit http://archive.ubuntu.com raring-updates/universe Translation-en
Hit http://archive.ubuntu.com raring-proposed/main Sources
Hit http://archive.ubuntu.com raring-proposed/restricted Sources
Hit http://archive.ubuntu.com raring-proposed/universe Sources
Hit http://archive.ubuntu.com raring-proposed/multiverse Sources
Hit http://archive.ubuntu.com raring-proposed/restricted amd64 Packages
Hit http://archive.ubuntu.com raring-proposed/main amd64 Packages
Hit http://archive.ubuntu.com raring-proposed/multiverse amd64 Packages
Hit http://archive.ubuntu.com raring-proposed/universe amd64 Packages
Hit http://archive.ubuntu.com raring-proposed/main Translation-en
Hit http://archive.ubuntu.com raring-proposed/multiverse Translation-en
Hit http://archive.ubuntu.com raring-proposed/restricted Translation-en
Hit http://archive.ubuntu.com raring-proposed/universe Translation-en
Ign http://archive.ubuntu.com raring/main Translation-en_US
Ign http://archive.ubuntu.com raring/multiverse Translation-en_US
Ign http://archive.ubuntu.com raring/restricted Translation-en_US
Ign http://archive.ubuntu.com raring/universe Translation-en_US
Ign http://archive.ubuntu.com raring-updates/main Translation-en_US
Ign http://archive.ubuntu.com raring-updates/universe Translation-en_US
Ign http://archive.ubuntu.com raring-proposed/main Translation-en_US
Ign http://archive.ubuntu.com raring-proposed/multiverse Translation-en_US
Ign http://archive.ubuntu.com raring-proposed/restricted Translation-en_US
Ign http://archive.ubuntu.com raring-proposed/universe Translation-en_US
Reading package lists...
adt-run: trace: * publish reinstall checking...
adt-run: trace: * publish install...
adt-run: trace: * publish done
adt-run: trace1: **  installing dependencies [u'python3', u'python3-aptdaemon.test', u'python3-gi', u'network-manager', u'gir1.2-networkmanager-1.0']
adt-run: trace: dependencies: install-deps: satisfying python3, python3-aptdaemon.test, python3-gi, network-manager, gir1.2-networkmanager-1.0
adt-run: trace: dependencies: install-deps: running ['/usr/lib/pbuilder/pbuilder-satisfydepends-classic', '--binary-all', '--internal-chrootexec', '/home/ubuntu/adt-log//satdep-auxverb', '-c', '/home/ubuntu/adt-log//deps.dsc']
 -> Attempting to parse the build-deps 
 -> Considering build-dep python3
   -> Trying python3
 -> Considering build-dep python3-aptdaemon.test
   -> Trying python3-aptdaemon.test
 -> Considering build-dep python3-gi
   -> Trying python3-gi
 -> Considering build-dep network-manager
   -> Trying network-manager
 -> Considering build-dep gir1.2-networkmanager-1.0
   -> Trying gir1.2-networkmanager-1.0
 -> Installing  python3 python3-aptdaemon.test python3-gi network-manager gir1.2-networkmanager-1.0
Reading package lists...
Building dependency tree...
Reading state information...
python3 is already the newest version.
python3-aptdaemon.test is already the newest version.
python3-gi is already the newest version.
gir1.2-networkmanager-1.0 is already the newest version.
network-manager is already the newest version.
0 upgraded, 0 newly installed, 0 to remove and 5 not upgraded.
 -> Finished parsing the build-deps
adt-run: trace: & dsc0t-dnsmasq: [----------------------------------------
+ buildtree=/tmp/tmp.2LpiuRMCPS/dsc0-build/network-manager-0.9.6.0+git201301021750.e78c3e8/
+ shift
+ rm -rf -- /tmp/tmp.2LpiuRMCPS/dsc0t-dnsmasq-testtmp /tmp/tmp.2LpiuRMCPS/dsc0t-dnsmasq-testtmp/tmpdir /tmp/tmp.2LpiuRMCPS/dsc0t-dnsmasq-testtmp/adttmp
+ mkdir -- /tmp/tmp.2LpiuRMCPS/dsc0t-dnsmasq-testtmp /tmp/tmp.2LpiuRMCPS/dsc0t-dnsmasq-testtmp/tmpdir /tmp/tmp.2LpiuRMCPS/dsc0t-dnsmasq-testtmp/adttmp
adt-run: trace: & dsc0t-dnsmasq:  - - - - - - - - - - results - - - - - - - - - -
dsc0t-dnsmasq        FAIL non-zero exit status 1
adt-run: trace: & dsc0t-dnsmasq:  - - - - - - - - - - stdout - - - - - - - - - -
Auto interfaces found: lo
Entering main event loop
Connected to the system bus
Registering null backend at priority -10
Using authority class PolkitBackendLocalAuthority
Acquired the name org.freedesktop.PolicyKit1
testDnsmasqHasDbus (__main__.TestDnsmasq) ... ERROR
testDnsmasqRunning (__main__.TestDnsmasq) ... ok

======================================================================
ERROR: testDnsmasqHasDbus (__main__.TestDnsmasq)
----------------------------------------------------------------------
Traceback (most recent call last):
  File "/usr/lib/python3/dist-packages/dbus/bus.py", line 175, in activate_name_owner
    return self.get_name_owner(bus_name)
  File "/usr/lib/python3/dist-packages/dbus/bus.py", line 361, in get_name_owner
    's', (bus_name,), **keywords)
  File "/usr/lib/python3/dist-packages/dbus/connection.py", line 651, in call_blocking
    message, timeout)
dbus.exceptions.DBusException: org.freedesktop.DBus.Error.NameHasNoOwner: Could not get owner of name 'org.freedesktop.NetworkManager.dnsmasq': no such name

During handling of the above exception, another exception occurred:

Traceback (most recent call last):
  File "/tmp/tmp.2LpiuRMCPS/dsc0-build/network-manager-0.9.6.0+git201301021750.e78c3e8/debian/tests/dnsmasq", line 49, in testDnsmasqHasDbus
    '/uk/org/thekelleys/dnsmasq')
  File "/usr/lib/python3/dist-packages/dbus/bus.py", line 241, in get_object
    follow_name_owner_changes=follow_name_owner_changes)
  File "/usr/lib/python3/dist-packages/dbus/proxies.py", line 248, in __init__
    self._named_service = conn.activate_name_owner(bus_name)
  File "/usr/lib/python3/dist-packages/dbus/bus.py", line 180, in activate_name_owner
    self.start_service_by_name(bus_name)
  File "/usr/lib/python3/dist-packages/dbus/bus.py", line 278, in start_service_by_name
    'su', (bus_name, flags)))
  File "/usr/lib/python3/dist-packages/dbus/connection.py", line 651, in call_blocking
    message, timeout)
dbus.exceptions.DBusException: org.freedesktop.DBus.Error.ServiceUnknown: The name org.freedesktop.NetworkManager.dnsmasq was not provided by any .service files

----------------------------------------------------------------------
Ran 2 tests in 30.095s

FAILED (errors=1)
adt-run: trace: & dsc0t-dnsmasq: ----------------------------------------]
adt-run: trace1: ** needs_reset, previously=False
adt-run: trace: @@@@@@@@@@@@@@@@@@@@@@@@@@@@@@@@@@@@@@@@ tests done.
adt-run: trace: ** stop
adt-run: trace: ** close, scratch=tb-scratch~/tmp/tmp.2LpiuRMCPS:-/|/tmp/tmp.2LpiuRMCPS/!
2013-01-18 22:13:24: Failure: adt-run exited with status 4.
Pseudo-terminal will not be allocated because stdin is not a terminal.
Warning: Permanently added '[localhost]:54323' (ECDSA) to the list of known hosts.
find: `./.autopkgtest/gpg': Permission denied
2013-01-18 22:13:25: Info: Test artifacts copied to <http://10.189.74.2:8080/job/raring-adt-network-manager/./ARCH=amd64,label=adt/ws/results>
2013-01-18 22:13:25: Info: Updating Jenkins results
Pseudo-terminal will not be allocated because stdin is not a terminal.
Warning: Permanently added '[localhost]:54323' (ECDSA) to the list of known hosts.
2013-01-18 22:13:27: Info: Cleaning up
Build step 'Execute shell' marked build as failure
Archiving artifacts



More information about the ubuntu-testing-notifications mailing list