=?UTF-8?Q?Build_failed_in_Jenkins:_raring-adt-gvfs_=C2=BB_amd64, adt_#55?=

Jenkins Notification devnull at canonical.com
Fri Jan 18 12:44:27 UTC 2013


See <http://10.189.74.2:8080/job/raring-adt-gvfs/./ARCH=amd64,label=adt/55/>

------------------------------------------
[...truncated 1095 lines...]
Setting up libxft2:amd64 (2.3.1-1) ...
Setting up fontconfig (2.10.2-0ubuntu1) ...
Regenerating fonts cache... done.
Setting up libpango1.0-0:amd64 (1.30.1-1ubuntu1) ...
Setting up libxcomposite1:amd64 (1:0.4.3-2build2) ...
Setting up libxcursor1:amd64 (1:1.1.13-1) ...
Setting up libxi6:amd64 (2:1.6.1-1) ...
Setting up libxinerama1:amd64 (2:1.1.2-1) ...
Setting up libxrandr2:amd64 (2:1.4.0-1) ...
Setting up shared-mime-info (1.0-1ubuntu2) ...
Setting up x11-common (1:7.7+1ubuntu4) ...
Setting up libkadm5clnt-mit8:amd64 (1.10.1+dfsg-3) ...
Setting up libkdb5-6:amd64 (1.10.1+dfsg-3) ...
Setting up libkadm5srv-mit8:amd64 (1.10.1+dfsg-3) ...
Setting up libmtp-common (1.1.5-1) ...
Setting up libmtp9:amd64 (1.1.5-1) ...
Setting up mysql-common (5.5.29-0ubuntu1) ...
Setting up libmysqlclient18:amd64 (5.5.29-0ubuntu1) ...
Setting up libpcrecpp0:amd64 (1:8.31-1ubuntu1) ...
Setting up libproxy1:amd64 (0.4.11-0ubuntu1) ...
Setting up libsecret-common (0.12-0ubuntu1) ...
Setting up libsecret-1-0:amd64 (0.12-0ubuntu1) ...
Setting up glib-networking-common (2.34.2-0ubuntu1) ...
Setting up glib-networking-services (2.34.2-0ubuntu1) ...
Setting up gsettings-desktop-schemas (3.6.1-0ubuntu1) ...
Setting up glib-networking:amd64 (2.34.2-0ubuntu1) ...
Setting up libsoup2.4-1:amd64 (2.40.2-0ubuntu1) ...
Setting up libsoup-gnome2.4-1:amd64 (2.40.2-0ubuntu1) ...
Setting up libtalloc2:amd64 (2.0.7+git20120207-1) ...
Setting up libtdb1:amd64 (1.2.10-2) ...
Setting up libudisks2-0:amd64 (2.0.1-1) ...
Setting up libwbclient0:amd64 (2:3.6.9-1ubuntu1) ...
Setting up libxcb-shape0:amd64 (1.8.1-2) ...
Setting up libxv1:amd64 (2:1.0.7-1) ...
Setting up libxxf86dga1:amd64 (2:1.1.3-2) ...
Setting up samba-common (2:3.6.9-1ubuntu1) ...

Creating config file /etc/samba/smb.conf with new version
Setting up libfile-copy-recursive-perl (0.38-1) ...
Setting up update-inetd (4.43) ...
Setting up samba-common-bin (2:3.6.9-1ubuntu1) ...
update-alternatives: using /usr/bin/nmblookup.samba3 to provide /usr/bin/nmblookup (nmblookup) in auto mode
update-alternatives: using /usr/bin/net.samba3 to provide /usr/bin/net (net) in auto mode
update-alternatives: using /usr/bin/testparm.samba3 to provide /usr/bin/testparm (testparm) in auto mode
Setting up samba (2:3.6.9-1ubuntu1) ...
Generating /etc/default/samba...
Adding group `sambashare' (GID 112) ...
Done.
update-alternatives: using /usr/bin/smbstatus.samba3 to provide /usr/bin/smbstatus (smbstatus) in auto mode
smbd start/running, process 7794
nmbd start/running, process 7828
Setting up udisks2 (2.0.1-1) ...
Setting up libsmbclient:amd64 (2:3.6.9-1ubuntu1) ...
Setting up libapr1 (1.4.6-3ubuntu1) ...
Setting up libaprutil1 (1.4.1-3) ...
Setting up libaprutil1-dbd-sqlite3 (1.4.1-3) ...
Setting up libaprutil1-ldap (1.4.1-3) ...
Setting up apache2.2-bin (2.2.22-6ubuntu4) ...
Setting up apache2-utils (2.2.22-6ubuntu4) ...
Setting up apache2.2-common (2.2.22-6ubuntu4) ...
Enabling site default.
Enabling module alias.
Enabling module autoindex.
Enabling module dir.
Enabling module env.
Enabling module mime.
Enabling module negotiation.
Enabling module setenvif.
Enabling module status.
Enabling module auth_basic.
Enabling module deflate.
Enabling module authz_default.
Enabling module authz_user.
Enabling module authz_groupfile.
Enabling module authn_file.
Enabling module authz_host.
Enabling module reqtimeout.
Setting up libldap2-dev:amd64 (2.4.31-1ubuntu2) ...
Setting up libexpat1-dev:amd64 (2.1.0-2) ...
Setting up libpcre3-dev:amd64 (1:8.31-1ubuntu1) ...
Setting up uuid-dev (2.20.1-5.1ubuntu5) ...
Setting up libapr1-dev (1.4.6-3ubuntu1) ...
Setting up libsqlite3-dev (3.7.15.2-1) ...
Setting up libpq5 (9.1.7-1bzr1) ...
Setting up zlib1g-dev:amd64 (1:1.2.7.dfsg-13ubuntu1) ...
Setting up libssl-dev (1.0.1c-4ubuntu2) ...
Setting up comerr-dev (2.1-1.42.5-1ubuntu4) ...
Setting up krb5-multidev (1.10.1+dfsg-3) ...
Setting up libkrb5-dev (1.10.1+dfsg-3) ...
Setting up libpq-dev (9.1.7-1bzr1) ...
Setting up libmysqlclient-dev (5.5.29-0ubuntu1) ...
Setting up libaprutil1-dev (1.4.1-3) ...
Setting up dbus-x11 (1.6.8-1ubuntu3) ...
Setting up genisoimage (9:1.1.11-2ubuntu3) ...
Setting up gvfs-libs:amd64 (1.15.2-0ubuntu1) ...
Setting up libcdio13 (0.83-4) ...
Setting up libcdio-cdda1 (0.83-4) ...
Setting up libcdio-paranoia1 (0.83-4) ...
Setting up libplist1 (1.8-2) ...
Setting up libusbmuxd2 (1.0.8-1) ...
Setting up usbmuxd (1.0.8-1) ...
Adding system user `usbmux' (UID 106) ...
Adding new user `usbmux' (UID 106) with group `plugdev' ...
Not creating home directory `/home/usbmux'.
Setting up libimobiledevice3 (1.1.4-1ubuntu2) ...
Processing triggers for ufw ...
Processing triggers for ureadahead ...
Setting up libice6:amd64 (2:1.0.8-2) ...
Setting up libsm6:amd64 (2:1.2.1-2) ...
Setting up libxt6:amd64 (1:1.1.3-1) ...
Setting up libxmu6:amd64 (2:1.1.1-1) ...
Setting up libxaw7:amd64 (2:1.0.10-2) ...
Setting up apache2-mpm-worker (2.2.22-6ubuntu4) ...
 * Starting web server apache2
apache2: Could not reliably determine the server's fully qualified domain name, using 127.0.1.1 for ServerName
   ...done.
Setting up apache2 (2.2.22-6ubuntu4) ...
Setting up apache2-prefork-dev (2.2.22-6ubuntu4) ...
Setting up libxtst6:amd64 (2:1.2.1-1) ...
Setting up at-spi2-core (2.7.4.1-1) ...
Setting up libgtk-3-0:amd64 (3.6.4-0ubuntu1) ...
Setting up x11-utils (7.7~1ubuntu1) ...
Setting up gvfs-daemons (1.15.2-0ubuntu1) ...
Setting up gvfs:amd64 (1.15.2-0ubuntu1) ...
Setting up gvfs-backends (1.15.2-0ubuntu1) ...
Setting up gvfs-fuse (1.15.2-0ubuntu1) ...
Setting up gvfs-dbg (1.15.2-0ubuntu1) ...
Processing triggers for libc-bin ...
ldconfig deferred processing now taking place
 -> Finished parsing the build-deps
adt-run: trace: & dsc0t-integration: [----------------------------------------
+ buildtree=/tmp/tmp.Uk44tkvO3T/dsc0-build/gvfs-1.15.2/
+ shift
+ rm -rf -- /tmp/tmp.Uk44tkvO3T/dsc0t-integration-testtmp /tmp/tmp.Uk44tkvO3T/dsc0t-integration-testtmp/tmpdir /tmp/tmp.Uk44tkvO3T/dsc0t-integration-testtmp/adttmp
+ mkdir -- /tmp/tmp.Uk44tkvO3T/dsc0t-integration-testtmp /tmp/tmp.Uk44tkvO3T/dsc0t-integration-testtmp/tmpdir /tmp/tmp.Uk44tkvO3T/dsc0t-integration-testtmp/adttmp
adt-run: trace: & dsc0t-integration:  - - - - - - - - - - results - - - - - - - - - -
dsc0t-integration    FAIL non-zero exit status 1
adt-run: trace: & dsc0t-integration:  - - - - - - - - - - stdout - - - - - - - - - -
smbd stop/waiting
nmbd stop/waiting
Added user ubuntu.
Running commmand in testbed: /home/gvfs-testbed-script 
test_api (__main__.ArchiveMounter)
archive:// with Gio API ... ok
test_iso_joliet (__main__.ArchiveMounter)
archive:// for Joliet .iso ... ok
test_iso_rr (__main__.ArchiveMounter)
archive:// for RockRidge .iso ... ok
test_tar (__main__.ArchiveMounter)
archive:// for tar ... ok
test_tar_bz2 (__main__.ArchiveMounter)
archive:// for tar.bz2 ... ok
test_tar_gz (__main__.ArchiveMounter)
archive:// for tar.gz ... ok
test_zip (__main__.ArchiveMounter)
archive:// for .zip ... /usr/sbin/apachectl: 87: ulimit: error setting limit (Operation not permitted)
ok
test_http_auth (__main__.Dav)
dav://localhost with credentials ... ok
test_http_noauth (__main__.Dav)
dav://localhost without credentials ... ok
test_https_auth (__main__.Dav)
davs://localhost with credentials ... ok
test_https_noauth (__main__.Dav)
davs://localhost without credentials ... /usr/sbin/apachectl: 87: ulimit: error setting limit (Operation not permitted)
ok
test_cdrom (__main__.Drive)
drive mount: cdrom ... ok
test_cdrom_api (__main__.Drive)
drive mount: cdrom with Gio API ... FAIL
test_media_player (__main__.Drive)
drive mount: media player ... ok
test_system_partition (__main__.Drive)
drive mount: system partition ... ok
test_system_partition_api (__main__.Drive)
drive mount: system partition with Gio API ... ok
test_anonymous_api (__main__.Ftp)
ftp:// anonymous (API) ... ok
test_anonymous_cli (__main__.Ftp)
ftp:// anonymous (CLI) ... ok
test_authenticated_api (__main__.Ftp)
ftp:// authenticated (API) ... ok
test_authenticated_cli (__main__.Ftp)
ftp:// authenticated (CLI) ... ok
test_gvfs_info_filesystem (__main__.Programs)
gvfs-info --filesystem ... ok
test_rsa (__main__.Sftp)
sftp://localhost with RSA authentication ... ok
test_unknown_host (__main__.Sftp)
sftp:// with RSA authentication for unknown host ... ok
test_anonymous (__main__.Smb)
smb:// anonymous ... ok
test_authenticated (__main__.Smb)
smb:// authenticated ... ok
test_deletion_with_same_path (__main__.Trash)
trash:// deletion of two files with the same path ... ok
test_file_in_home_api (__main__.Trash)
trash:// deletion, attributes, restoring for a file in $HOME (API) ... ok
test_file_in_home_cli (__main__.Trash)
trash:// deletion, attributes, restoring for a file in $HOME (CLI) ... ok
test_file_in_system (__main__.Trash)
trash:// deletion for system location ... ok

======================================================================
FAIL: test_cdrom_api (__main__.Drive)
drive mount: cdrom with Gio API
----------------------------------------------------------------------
Traceback (most recent call last):
  File "/home/gvfs-testbed-script", line 1037, in test_cdrom_api
    self.assertEqual(self.cb_result[1], True)
AssertionError: GError('The given volume was not found',) != True

----------------------------------------------------------------------
Ran 29 tests in 64.312s

FAILED (failures=1)
=== command failed, showing Samba log files ===
--- /var/log/samba/log.nmbd ---
[2013/01/18 12:43:06,  0] nmbd/nmbd.c:861(main)
  nmbd version 3.6.9 started.
  Copyright Andrew Tridgell and the Samba Team 1992-2011
[2013/01/18 12:43:06,  0] nmbd/nmbd_subnetdb.c:250(create_subnets)
  create_subnets: No local IPv4 non-loopback interfaces !
[2013/01/18 12:43:06,  0] nmbd/nmbd_subnetdb.c:251(create_subnets)
  create_subnets: Waiting for an interface to appear ...
--- /var/log/samba/log.smbd ---
[2013/01/18 12:43:06,  0] smbd/server.c:1026(main)
  smbd version 3.6.9 started.
  Copyright Andrew Tridgell and the Samba Team 1992-2011
[2013/01/18 12:43:06.427511,  0] printing/print_cups.c:151(cups_connect)
  Unable to connect to CUPS server localhost:631 - Transport endpoint is not connected
[2013/01/18 12:43:06.427758,  0] printing/print_cups.c:528(cups_async_callback)
  failed to retrieve printer list: NT_STATUS_UNSUCCESSFUL
adt-run: trace: & dsc0t-integration: ----------------------------------------]
adt-run: trace1: ** needs_reset, previously=False
adt-run: trace: @@@@@@@@@@@@@@@@@@@@@@@@@@@@@@@@@@@@@@@@ tests done.
adt-run: trace: ** stop
adt-run: trace: ** close, scratch=tb-scratch~/tmp/tmp.Uk44tkvO3T:-/|/tmp/tmp.Uk44tkvO3T/!
2013-01-18 12:44:22: Failure: adt-run exited with status 4.
Pseudo-terminal will not be allocated because stdin is not a terminal.
Warning: Permanently added '[localhost]:54323' (ECDSA) to the list of known hosts.
find: `./.autopkgtest/gpg': Permission denied
2013-01-18 12:44:26: Info: Test artifacts copied to <http://10.189.74.2:8080/job/raring-adt-gvfs/./ARCH=amd64,label=adt/ws/results>
2013-01-18 12:44:26: Info: Updating Jenkins results
Pseudo-terminal will not be allocated because stdin is not a terminal.
Warning: Permanently added '[localhost]:54323' (ECDSA) to the list of known hosts.
2013-01-18 12:44:26: Info: Cleaning up
Build step 'Execute shell' marked build as failure
Archiving artifacts



More information about the ubuntu-testing-notifications mailing list