Build failed in Jenkins: raring-adt-dbus-test-runner » amd64,adt #4

Jenkins Notification devnull at canonical.com
Fri Jan 18 12:43:25 UTC 2013


See <http://10.189.74.2:8080/job/raring-adt-dbus-test-runner/./ARCH=amd64,label=adt/4/>

------------------------------------------
[...truncated 1013 lines...]
NOCONFIGURE=1 dh_autoreconf ./autogen.sh
/usr/bin/gnome-autogen.sh
checking for autoconf >= 2.53...
  testing autoconf2.50... not found.
  testing autoconf... found 2.69
checking for automake >= 1.9...
  testing automake-1.12... not found.
  testing automake-1.11... found 1.11.6
checking for libtool >= 1.5...
  testing libtoolize... found 2.4.2
checking for glib-gettext >= 2.2.0...
  testing glib-gettextize... found 2.35.4
checking for intltool >= 0.30...
  testing intltoolize... found 0.50.2
checking for pkg-config >= 0.14.0...
  testing pkg-config... found 0.26
Checking for required M4 macros...
Checking for forbidden M4 macros...
Processing ./configure.ac
Running libtoolize...
libtoolize: putting auxiliary files in `.'.
libtoolize: copying file `./ltmain.sh'
libtoolize: putting macros in AC_CONFIG_MACRO_DIR, `m4'.
libtoolize: copying file `m4/libtool.m4'
libtoolize: copying file `m4/ltoptions.m4'
libtoolize: copying file `m4/ltsugar.m4'
libtoolize: copying file `m4/ltversion.m4'
libtoolize: copying file `m4/lt~obsolete.m4'
libtoolize: Consider adding `-I m4' to ACLOCAL_AMFLAGS in Makefile.am.
Running glib-gettextize... Ignore non-fatal messages.
Copying file po/Makefile.in.in

Please add the files
  codeset.m4 gettext.m4 glibc21.m4 iconv.m4 isc-posix.m4 lcmessage.m4
  progtest.m4
from the /usr/share/aclocal directory to your autoconf macro directory
or directly to your aclocal.m4 file.
You will also need config.guess and config.sub, which you can get from
ftp://ftp.gnu.org/pub/gnu/config/.

Running intltoolize...
Running aclocal-1.11...
Running autoconf...
Running autoheader...
Running automake-1.11...
configure.ac:15: installing `./compile'
configure.ac:17: installing `./config.guess'
configure.ac:17: installing `./config.sub'
configure.ac:8: installing `./install-sh'
configure.ac:8: installing `./missing'
libdbustest/Makefile.am: installing `./depcomp'
Makefile.am: installing `./INSTALL'
Makefile.am: installing `./COPYING' using GNU General Public License v3 file
Makefile.am:     Consider adding the COPYING file to the version control system
Makefile.am:     for your code, to avoid questions about which license your project uses.
Skipping configure process.
make[1]: Leaving directory `/tmp/tmp.j8ESTBPXxL/dsc0-build/dbus-test-runner-12.10.2daily13.01.10'
   debian/rules override_dh_auto_configure
make[1]: Entering directory `/tmp/tmp.j8ESTBPXxL/dsc0-build/dbus-test-runner-12.10.2daily13.01.10'
dh_auto_configure -- --disable-scrollkeeper
configure: WARNING: unrecognized options: --disable-scrollkeeper
checking for a BSD-compatible install... /usr/bin/install -c
checking whether build environment is sane... yes
checking for a thread-safe mkdir -p... /bin/mkdir -p
checking for gawk... no
checking for mawk... mawk
checking whether make sets $(MAKE)... yes
checking whether to enable maintainer-specific portions of Makefiles... no
checking whether NLS is requested... yes
checking for style of include used by make... GNU
checking for gcc... gcc
checking whether the C compiler works... yes
checking for C compiler default output file name... a.out
checking for suffix of executables... 
checking whether we are cross compiling... no
checking for suffix of object files... o
checking whether we are using the GNU C compiler... yes
checking whether gcc accepts -g... yes
checking for gcc option to accept ISO C89... none needed
checking dependency style of gcc... none
checking for intltool >= 0.35.0... 0.50.2 found
checking for intltool-update... /usr/bin/intltool-update
checking for intltool-merge... /usr/bin/intltool-merge
checking for intltool-extract... /usr/bin/intltool-extract
checking for xgettext... /usr/bin/xgettext
checking for msgmerge... /usr/bin/msgmerge
checking for msgfmt... /usr/bin/msgfmt
checking for gmsgfmt... /usr/bin/msgfmt
checking for perl... /usr/bin/perl
checking for perl >= 5.8.1... 5.14.2
checking for XML::Parser... ok
checking for library containing strerror... none required
checking for gcc... (cached) gcc
checking whether we are using the GNU C compiler... (cached) yes
checking whether gcc accepts -g... (cached) yes
checking for gcc option to accept ISO C89... (cached) none needed
checking dependency style of gcc... (cached) none
checking whether gcc and cc understand -c and -o together... yes
checking how to run the C preprocessor... gcc -E
checking for grep that handles long lines and -e... /bin/grep
checking for egrep... /bin/grep -E
checking for ANSI C header files... yes
checking build system type... x86_64-pc-linux-gnu
checking host system type... x86_64-pc-linux-gnu
checking how to print strings... printf
checking for a sed that does not truncate output... /bin/sed
checking for fgrep... /bin/grep -F
checking for ld used by gcc... /usr/bin/ld
checking if the linker (/usr/bin/ld) is GNU ld... yes
checking for BSD- or MS-compatible name lister (nm)... /usr/bin/nm -B
checking the name lister (/usr/bin/nm -B) interface... BSD nm
checking whether ln -s works... yes
checking the maximum length of command line arguments... 3458764513820540925
checking whether the shell understands some XSI constructs... yes
checking whether the shell understands "+="... yes
checking how to convert x86_64-pc-linux-gnu file names to x86_64-pc-linux-gnu format... func_convert_file_noop
checking how to convert x86_64-pc-linux-gnu file names to toolchain format... func_convert_file_noop
checking for /usr/bin/ld option to reload object files... -r
checking for objdump... objdump
checking how to recognize dependent libraries... pass_all
checking for dlltool... no
checking how to associate runtime and link libraries... printf %s\n
checking for ar... ar
checking for archiver @FILE support... @
checking for strip... strip
checking for ranlib... ranlib
checking command to parse /usr/bin/nm -B output from gcc object... ok
checking for sysroot... no
checking for mt... mt
checking if mt is a manifest tool... no
checking for sys/types.h... yes
checking for sys/stat.h... yes
checking for stdlib.h... yes
checking for string.h... yes
checking for memory.h... yes
checking for strings.h... yes
checking for inttypes.h... yes
checking for stdint.h... yes
checking for unistd.h... yes
checking for dlfcn.h... yes
checking for objdir... .libs
checking if gcc supports -fno-rtti -fno-exceptions... no
checking for gcc option to produce PIC... -fPIC -DPIC
checking if gcc PIC flag -fPIC -DPIC works... yes
checking if gcc static flag -static works... yes
checking if gcc supports -c -o file.o... yes
checking if gcc supports -c -o file.o... (cached) yes
checking whether the gcc linker (/usr/bin/ld -m elf_x86_64) supports shared libraries... yes
checking whether -lc should be explicitly linked in... no
checking dynamic linker characteristics... GNU/Linux ld.so
checking how to hardcode library paths into programs... immediate
checking whether stripping libraries is possible... yes
checking if libtool supports shared libraries... yes
checking whether to build shared libraries... yes
checking whether to build static libraries... yes
checking whether make supports nested variables... yes
checking for pkg-config... /usr/bin/pkg-config
checking pkg-config is at least version 0.9.0... yes
checking for DBUS_TEST_RUNNER... yes
checking locale.h usability... yes
checking locale.h presence... yes
checking for locale.h... yes
checking for LC_MESSAGES... yes
checking libintl.h usability... yes
checking libintl.h presence... yes
checking for libintl.h... yes
checking for ngettext in libc... yes
checking for dgettext in libc... yes
checking for bind_textdomain_codeset... yes
checking for msgfmt... (cached) /usr/bin/msgfmt
checking for dcgettext... yes
checking if msgfmt accepts -c... yes
checking for gmsgfmt... (cached) /usr/bin/msgfmt
checking for xgettext... (cached) /usr/bin/xgettext
checking for bustle... no
configure: creating ./config.status
config.status: creating Makefile
config.status: creating po/Makefile.in
config.status: creating libdbustest/Makefile
config.status: creating src/Makefile
config.status: creating data/Makefile
config.status: creating tests/Makefile
config.status: creating config.h
config.status: executing depfiles commands
config.status: executing libtool commands
config.status: executing default-1 commands
config.status: executing po/stamp-it commands
configure: WARNING: unrecognized options: --disable-scrollkeeper
configure:

dbus-test-runner Configuration:

	Prefix:                 /usr

	Coverage reporting:     no

make[1]: Leaving directory `/tmp/tmp.j8ESTBPXxL/dsc0-build/dbus-test-runner-12.10.2daily13.01.10'
   dh_auto_build
make[1]: Entering directory `/tmp/tmp.j8ESTBPXxL/dsc0-build/dbus-test-runner-12.10.2daily13.01.10'
make  all-recursive
make[2]: Entering directory `/tmp/tmp.j8ESTBPXxL/dsc0-build/dbus-test-runner-12.10.2daily13.01.10'
Making all in data
make[3]: Entering directory `/tmp/tmp.j8ESTBPXxL/dsc0-build/dbus-test-runner-12.10.2daily13.01.10/data'
make[3]: Nothing to be done for `all'.
make[3]: Leaving directory `/tmp/tmp.j8ESTBPXxL/dsc0-build/dbus-test-runner-12.10.2daily13.01.10/data'
Making all in libdbustest
make[3]: Entering directory `/tmp/tmp.j8ESTBPXxL/dsc0-build/dbus-test-runner-12.10.2daily13.01.10/libdbustest'
  CC     libdbustest_la-bustle.lo
  CC     libdbustest_la-process.lo
  CC     libdbustest_la-service.lo
  CC     libdbustest_la-task.lo
  CCLD   libdbustest.la
sed \
		-e "s:\@apiversion\@:1:" \
		-e "s:\@libdir\@:/usr/lib/x86_64-linux-gnu:" \
		-e "s:\@includedir\@:/usr/include:" \
		-e "s:\@VERSION\@:12.10.1:" \
		dbustest.pc.in > dbustest-1.pc
make[3]: Leaving directory `/tmp/tmp.j8ESTBPXxL/dsc0-build/dbus-test-runner-12.10.2daily13.01.10/libdbustest'
Making all in src
make[3]: Entering directory `/tmp/tmp.j8ESTBPXxL/dsc0-build/dbus-test-runner-12.10.2daily13.01.10/src'
  CC     dbus_test_runner-dbus-test-runner.o
dbus-test-runner.c: In function ‘main’:
dbus-test-runner.c:184:2: error: ‘g_type_init’ is deprecated (declared at /usr/include/glib-2.0/gobject/gtype.h:669) [-Werror=deprecated-declarations]
cc1: all warnings being treated as errors
make[3]: *** [dbus_test_runner-dbus-test-runner.o] Error 1
make[3]: Leaving directory `/tmp/tmp.j8ESTBPXxL/dsc0-build/dbus-test-runner-12.10.2daily13.01.10/src'
make[2]: *** [all-recursive] Error 1
make[2]: Leaving directory `/tmp/tmp.j8ESTBPXxL/dsc0-build/dbus-test-runner-12.10.2daily13.01.10'
make[1]: *** [all] Error 2
make[1]: Leaving directory `/tmp/tmp.j8ESTBPXxL/dsc0-build/dbus-test-runner-12.10.2daily13.01.10'
dh_auto_build: make -j1 returned exit code 2
make: *** [build] Error 2
blame: arg:dbus-test-runner_12.10.2daily13.01.10-0ubuntu1.dsc dsc:dbus-test-runner
badpkg: rules build failed with exit code 2
adt-run: erroneous package: rules build failed with exit code 2
adt-run: trace: ** stop
adt-run: trace: ** close, scratch=tb-scratch~/tmp/tmp.j8ESTBPXxL:-/|/tmp/tmp.j8ESTBPXxL/!
2013-01-18 12:43:23 PM: Failure: adt-run exited with status 12.
Pseudo-terminal will not be allocated because stdin is not a terminal.
Warning: Permanently added '[localhost]:54323' (ECDSA) to the list of known hosts.
find: `./.autopkgtest/gpg': Permission denied
2013-01-18 12:43:24 PM: Info: Test artifacts copied to <http://10.189.74.2:8080/job/raring-adt-dbus-test-runner/./ARCH=amd64,label=adt/ws/results>
2013-01-18 12:43:24 PM: Info: Updating Jenkins results
Pseudo-terminal will not be allocated because stdin is not a terminal.
Warning: Permanently added '[localhost]:54323' (ECDSA) to the list of known hosts.
2013-01-18 12:43:25 PM: Info: Cleaning up
Build step 'Execute shell' marked build as failure
Archiving artifacts



More information about the ubuntu-testing-notifications mailing list