Build failed in Jenkins: raring-adt-software-center » i386,adt #60

Jenkins Notification devnull at canonical.com
Thu Dec 13 22:00:36 UTC 2012


See <http://10.189.74.2:8080/job/raring-adt-software-center/./ARCH=i386,label=adt/60/>

------------------------------------------
[...truncated 1980 lines...]
Rebuilding Xapian index... 56% 
Rebuilding Xapian index... 56% 
Rebuilding Xapian index... 57% 
Rebuilding Xapian index... 57% 
Rebuilding Xapian index... 58% 
Rebuilding Xapian index... 58% 
Rebuilding Xapian index... 59% 
Rebuilding Xapian index... 59% 
Rebuilding Xapian index... 60% 
Rebuilding Xapian index... 60% 
Rebuilding Xapian index... 61% 
Rebuilding Xapian index... 61% 
Rebuilding Xapian index... 62% 
Rebuilding Xapian index... 62% 
Rebuilding Xapian index... 63% 
Rebuilding Xapian index... 63% 
Rebuilding Xapian index... 64% 
Rebuilding Xapian index... 64% 
Rebuilding Xapian index... 65% 
Rebuilding Xapian index... 65% 
Rebuilding Xapian index... 66% 
Rebuilding Xapian index... 66% 
Rebuilding Xapian index... 66% 
Rebuilding Xapian index... 67% 
Rebuilding Xapian index... 67% 
Rebuilding Xapian index... 68% 
Rebuilding Xapian index... 68% 
Rebuilding Xapian index... 69% 
Rebuilding Xapian index... 69% 
Rebuilding Xapian index... 70% 
Rebuilding Xapian index... 70% 
Rebuilding Xapian index... 71% 
Rebuilding Xapian index... 71% 
Rebuilding Xapian index... 72% 
Rebuilding Xapian index... 72% 
Rebuilding Xapian index... 73% 
Rebuilding Xapian index... 73% 
Rebuilding Xapian index... 74% 
Rebuilding Xapian index... 74% 
Rebuilding Xapian index... 75% 
Rebuilding Xapian index... 75% 
Rebuilding Xapian index... 76% 
Rebuilding Xapian index... 76% 
Rebuilding Xapian index... 77% 
Rebuilding Xapian index... 77% 
Rebuilding Xapian index... 78% 
Rebuilding Xapian index... 78% 
Rebuilding Xapian index... 79% 
Rebuilding Xapian index... 79% 
Rebuilding Xapian index... 80% 
Rebuilding Xapian index... 80% 
Rebuilding Xapian index... 81% 
Rebuilding Xapian index... 81% 
Rebuilding Xapian index... 82% 
Rebuilding Xapian index... 82% 
Rebuilding Xapian index... 83% 
Rebuilding Xapian index... 83% 
Rebuilding Xapian index... 83% 
Rebuilding Xapian index... 84% 
Rebuilding Xapian index... 84% 
Rebuilding Xapian index... 85% 
Rebuilding Xapian index... 85% 
Rebuilding Xapian index... 86% 
Rebuilding Xapian index... 86% 
Rebuilding Xapian index... 87% 
Rebuilding Xapian index... 87% 
Rebuilding Xapian index... 88% 
Rebuilding Xapian index... 88% 
Rebuilding Xapian index... 89% 
Rebuilding Xapian index... 89% 
Rebuilding Xapian index... 90% 
Rebuilding Xapian index... 90% 
Rebuilding Xapian index... 91% 
Rebuilding Xapian index... 91% 
Rebuilding Xapian index... 92% 
Rebuilding Xapian index... 92% 
Rebuilding Xapian index... 93% 
Rebuilding Xapian index... 93% 
Rebuilding Xapian index... 94% 
Rebuilding Xapian index... 94% 
Rebuilding Xapian index... 95% 
Rebuilding Xapian index... 95% 
Rebuilding Xapian index... 96% 
Rebuilding Xapian index... 96% 
Rebuilding Xapian index... 97% 
Rebuilding Xapian index... 97% 
Rebuilding Xapian index... 98% 
Rebuilding Xapian index... 98% 
Rebuilding Xapian index... 99% 
Rebuilding Xapian index... 99% 
Rebuilding Xapian index... 99% 
Rebuilding Xapian index: done.  
+ id ubuntu
+ 
+ id -u
+ [ 1000 = 0 ]
+ xvfb-run ./run-tests.sh
No coverage for now.
Testing test_globalpane...                        [  OK  ]
Testing test_installedpane...                     [  OK  ]
Testing test_availablepane...                     [  OK  ]
Testing test_exhibits...                          [  OK  ]
Testing test_catview...                           [  OK  ]
Testing test_webkit...                            [  OK  ]
Testing test_dialogs...                           [  OK  ]
Testing test_search...                            [  OK  ]
Testing test_recommendations_widgets...           [  OK  ]
Testing test_appdetailsview...                    [  OK  ]
Testing test_navhistory...                        [  OK  ]
Testing test_purchase...                          [  OK  ]
Testing test_appmanager...                        [  OK  ]
Testing test_panes...                             [  OK  ]
Testing test_app_view...                          [  OK  ]
Testing test_debfile_view...                      [  OK  ]
Testing test_widgets...                           [  OK  ]
Testing test_buttons...                           [  OK  ]
Testing test_install_progress...                  [  OK  ]
Testing test_spinner...                           [  OK  ]
Testing test_app...                               [  OK  ]
Testing test_views...                             [  OK  ]
Testing test_reviews...                           [  OK  ]
Testing test_lp1048912...                         [  OK  ]
Testing test_appstore2...                         [  OK  ]
Testing test_unity_launcher_integration...        [  OK  ]
Testing test_custom_lists...                      [  OK  ]
Testing test_config...                            [  OK  ]
Testing test_startup...                           [  OK  ]
Testing test_aptd...                              [  OK  ]
Testing test_dataprovider...                      [  OK  ]
Testing test_pep8...                              [  OK  ]
Testing test_purchase_backend...                  [  OK  ]
Testing test_plugin...                            [  OK  ]
Testing test_xapian_query...                      [  OK  ]
Testing test_logging...                           [  OK  ]
Testing test_pyflakes...                          [  OK  ]
Testing test_enquire...                           [  OK  ]
Testing test_ubuntu_sso_api...                    [  OK  ]
Testing test_origin...                            [ FAIL ]
Testing test_gwibber...                           [  OK  ]
Testing test_region...                            [  OK  ]
Testing test_downloader...                        [  OK  ]
Testing test_apthistory...                        [  OK  ]
Testing test_netstatus...                         [  OK  ]
Testing test_rnr_api...                           [  OK  ]
Testing test_database...                          [  OK  ]
Testing test_recagent...                          [  OK  ]
Testing test_hw...                                [  OK  ]
Testing test_scagent...                           [  OK  ]
Testing test_utils...                             [  OK  ]
Testing test_channels...                          [  OK  ]
Testing test_reinstall_purchased...               [  OK  ]
Testing test_categories...                        [  OK  ]
Testing test_mime...                              [  OK  ]
Testing test_cmdfiner...                          [  OK  ]
Testing test_xapian...                            [  OK  ]
Testing test_package_info...                      [  OK  ]
Testing test_login_backend...                     [  OK  ]
Testing test_where_is_it...                       [  OK  ]
Testing test_htmlize...                           [  OK  ]
Testing test_spawn_helper...                      [  OK  ]
Testing test_application...                       [  OK  ]
Testing test_debfileapplication...                [  OK  ]
Testing test_addons...                            [  OK  ]
Testing test_distro...                            [  OK  ]
Testing test_testutils...                         [ FAIL ]
Testing test_ppa_iconfilename...                  [  OK  ]
Testing test_pkginfo...                           [  OK  ]
Testing test_description_norm...                  [  OK  ]
Testing test_i18n...                              [  OK  ]
FAILED:  test_origin test_testutils
Check tests/output/ directory for the details
+ cat ./tests/output/test_origin.out.FAIL ./tests/output/test_testutils.out.FAIL
Traceback (most recent call last):
  File "/usr/lib/python2.7/runpy.py", line 162, in _run_module_as_main
    "__main__", fname, loader, pkg_name)
  File "/usr/lib/python2.7/runpy.py", line 72, in _run_code
    exec code in run_globals
  File "/usr/lib/python2.7/unittest/__main__.py", line 12, in <module>
    main(module=None)
  File "/usr/lib/python2.7/unittest/main.py", line 94, in __init__
    self.parseArgs(argv)
  File "/usr/lib/python2.7/unittest/main.py", line 149, in parseArgs
    self.createTests()
  File "/usr/lib/python2.7/unittest/main.py", line 158, in createTests
    self.module)
  File "/usr/lib/python2.7/unittest/loader.py", line 128, in loadTestsFromNames
    suites = [self.loadTestsFromName(name, module) for name in names]
  File "/usr/lib/python2.7/unittest/loader.py", line 91, in loadTestsFromName
    module = __import__('.'.join(parts_copy))
  File "tests/test_origin.py", line 13, in <module>
    class TestOrigins(unittest.TestCase):
  File "tests/test_origin.py", line 17, in TestOrigins
    url_accessable("http://de.archive.ubuntu.com/ubuntu", "dists/"),
  File "tests/utils.py", line 64, in url_accessable
    f = urlopen(url)
  File "/usr/lib/python2.7/urllib2.py", line 127, in urlopen
    return _opener.open(url, data, timeout)
  File "/usr/lib/python2.7/urllib2.py", line 401, in open
    response = self._open(req, data)
  File "/usr/lib/python2.7/urllib2.py", line 419, in _open
    '_open', req)
  File "/usr/lib/python2.7/urllib2.py", line 379, in _call_chain
    result = func(*args)
  File "/usr/lib/python2.7/urllib2.py", line 1211, in http_open
    return self.do_open(httplib.HTTPConnection, req)
  File "/usr/lib/python2.7/urllib2.py", line 1181, in do_open
    raise URLError(err)
urllib2.URLError: <urlopen error [Errno 111] Connection refused>
test_fake_aptd (tests.test_testutils.DummyBackendTestUtilsTestCase) ... 21:59:39 AptDaemon [INFO]: Initializing daemon
21:59:39 AptDaemon [INFO]: CommitPackages() was called: dbus.Array([dbus.String('')], signature=dbus.Signature('s')), dbus.Array([dbus.String('')], signature=dbus.Signature('s')), dbus.Array([dbus.String('')], signature=dbus.Signature('s')), dbus.Array([dbus.String('')], signature=dbus.Signature('s')), dbus.Array([dbus.String('')], signature=dbus.Signature('s')), dbus.Array([dbus.String('')], signature=dbus.Signature('s'))
21:59:39 AptDaemon.Trans [INFO]: Queuing transaction /org/debian/apt/transaction/7fb51c6b5f3b4e2b9f858592b8272045
21:59:40 AptDaemon [INFO]: Quitting was requested
ok
test_start_stop_dummy_backend (tests.test_testutils.DummyBackendTestUtilsTestCase) ... 21:59:40 AptDaemon [INFO]: Initializing daemon
FAIL
21:59:40 AptDaemon [INFO]: Quitting was requested
test_app_properties_helper_mock_with_custom_values (tests.test_testutils.TestUtilsTestCase) ... ok
test_app_properties_helper_mock_with_defaults (tests.test_testutils.TestUtilsTestCase) ... ok
test_url_accessable (tests.test_testutils.TestUtilsTestCase) ... ok

======================================================================
FAIL: test_start_stop_dummy_backend (tests.test_testutils.DummyBackendTestUtilsTestCase)
----------------------------------------------------------------------
Traceback (most recent call last):
  File "tests/test_testutils.py", line 40, in test_start_stop_dummy_backend
    self.assertEqual(len(names), 4)
AssertionError: 6 != 4

----------------------------------------------------------------------
Ran 5 tests in 1.968s

FAILED (failures=1)
+ exit 1
adt-run: trace: & dsc0t-run-tests: ----------------------------------------]
adt-run: trace1: ** needs_reset, previously=False
adt-run: trace: @@@@@@@@@@@@@@@@@@@@@@@@@@@@@@@@@@@@@@@@ tests done.
adt-run: trace: ** stop
adt-run: trace: ** close, scratch=tb-scratch~/tmp/tmp.6IPb3K3Ok3:-/|/tmp/tmp.6IPb3K3Ok3/!
2012-12-13 10:00:30 PM: Failure: adt-run exited with status 4.
Pseudo-terminal will not be allocated because stdin is not a terminal.
Warning: Permanently added '[localhost]:54324' (ECDSA) to the list of known hosts.
find: `./.autopkgtest/gpg': Permission denied
2012-12-13 10:00:32 PM: Info: Test artifacts copied to <http://10.189.74.2:8080/job/raring-adt-software-center/./ARCH=i386,label=adt/ws/results>
2012-12-13 10:00:32 PM: Info: Updating Jenkins results
Pseudo-terminal will not be allocated because stdin is not a terminal.
Warning: Permanently added '[localhost]:54324' (ECDSA) to the list of known hosts.
2012-12-13 10:00:36 PM: Info: Cleaning up
Build step 'Execute shell' marked build as failure
Archiving artifacts



More information about the ubuntu-testing-notifications mailing list