Build failed in Jenkins: precise-upgrade-oneiric-server » i386,non-lts,server,upgrade-test #333

Jenkins Notification devnull at canonical.com
Thu Dec 13 17:37:55 UTC 2012


See <http://10.189.74.2:8080/job/precise-upgrade-oneiric-server/./ARCH=i386,LTS=non-lts,PROFILE=server,label=upgrade-test/333/>

------------------------------------------
Started by upstream project "precise-upgrade-oneiric-server" build number 333
[EnvInject] - Loading node environment variables.
Building remotely on aldebaran-upgrade
No emails were triggered.
[upgrade-test] $ /bin/sh -x /tmp/hudson5150053746122272953.sh
+ rm -Rf auto-upgrade-testing results
+ BRANCH=auto-upgrade-testing
+ [ -d auto-upgrade-testing ]
+ bzr branch lp:auto-upgrade-testing
You have not informed bzr of your Launchpad ID, and you must do this to
write to Launchpad or access private data.  See "bzr help launchpad-login".
Branched 62 revisions.
+ cd auto-upgrade-testing
+ LTSPREFIX=
+ ARCHEXT=
+ BASEDIR=/var/home/upgrade-tester/auto-upgrade-tester
+ [ non-lts = non-lts ]
+ LTSPREFIX=
+ ARCHEXT=i386
+ PROFILENAME=server-i386
+ [ i386 = i386 ]
+ [ ! -e /var/home/upgrade-tester/auto-upgrade-tester/profiles/server-i386 ]
+ PROFILENAME=server
+ echo Running profile server
Running profile server
+ python bin/auto-upgrade-tester /var/home/upgrade-tester/auto-upgrade-tester/profiles/server
Testing '/var/home/upgrade-tester/auto-upgrade-tester/profiles/server'
Port 54322 already in use. Skipping!
using ssh port: 54323
Port 5901 already in use. Skipping!
using VncNum: 5902
Storing the result in '/var/home/upgrade-tester/auto-upgrade-tester/result/server'
2012-12-13 17:07:32.316170 log started
bootstrap()
Not bootstrapping again, we have a cached BaseImage
upgrade()
Starting for upgrade
Starting ['kvm', '-hda', '/var/home/upgrade-tester/auto-upgrade-tester/test-image.server', '-monitor', 'stdio', '-localtime', '-no-reboot', '-net', 'nic,model=virtio', '-net', 'user', '-redir', 'tcp:54323::22', '-vnc', 'localhost:2', '-m', '1536']
Could not start image after 900s, exiting
FAILED: upgrade for '/var/home/upgrade-tester/auto-upgrade-tester/profiles/server'
Failed to upgrade /var/home/upgrade-tester/auto-upgrade-tester/profiles/server
Logs can be found here:
 /var/home/upgrade-tester/auto-upgrade-tester/result/server/bootstrap.log
 /var/home/upgrade-tester/auto-upgrade-tester/result/server/main.log
 /var/home/upgrade-tester/auto-upgrade-tester/result/server/apt.log
2012-12-13 17:25:12.186456 log ended.
Duration: 0:17:39.870286
Profile '/var/home/upgrade-tester/auto-upgrade-tester/profiles/server' FAILED
stop
stop pid:  <subprocess.Popen object at 0x21fc590>
waiting for qemu to shutdown
Not stopped after 600s, killing 
qemu stopped
Releasing lock: /var/lock/auto-upgrade-tester.54323.lock
Releasing lock: /var/lock/auto-upgrade-tester.5902.lock
+ cp -ar /var/home/upgrade-tester/auto-upgrade-tester/result/server/ <http://10.189.74.2:8080/job/precise-upgrade-oneiric-server/./ARCH=i386,LTS=non-lts,PROFILE=server,label=upgrade-test/ws/results>
Archiving artifacts
Recording test results
No test report files were found. Configuration error?
Build step 'Publish JUnit test result report' changed build result to FAILURE



More information about the ubuntu-testing-notifications mailing list