Build failed in Jenkins: precise-upgrade-lucid-main » i386,lts,main-all,upgrade-test #317

Jenkins Notification devnull at canonical.com
Thu Dec 13 16:27:49 UTC 2012


See <http://10.189.74.2:8080/job/precise-upgrade-lucid-main/./ARCH=i386,LTS=lts,PROFILE=main-all,label=upgrade-test/317/>

------------------------------------------
Started by upstream project "precise-upgrade-lucid-main" build number 317
[EnvInject] - Loading node environment variables.
Building remotely on alderamin-upgrade
No emails were triggered.
[upgrade-test] $ /bin/sh -x /tmp/hudson3300567486062400589.sh
+ rm -Rf auto-upgrade-testing results
+ BRANCH=auto-upgrade-testing
+ [ -d auto-upgrade-testing ]
+ bzr branch lp:auto-upgrade-testing
You have not informed bzr of your Launchpad ID, and you must do this to
write to Launchpad or access private data.  See "bzr help launchpad-login".
Branched 62 revisions.
+ cd auto-upgrade-testing
+ LTSPREFIX=
+ ARCHEXT=
+ BASEDIR=/home/upgrade-tester/auto-upgrade-tester
+ [ lts = non-lts ]
+ LTSPREFIX=lts-
+ ARCHEXT=i386
+ PROFILENAME=lts-main-all-i386
+ [ i386 = i386 ]
+ [ ! -e /home/upgrade-tester/auto-upgrade-tester/profiles/lts-main-all-i386 ]
+ PROFILENAME=lts-main-all
+ echo Running profile lts-main-all
Running profile lts-main-all
+ python bin/auto-upgrade-tester /home/upgrade-tester/auto-upgrade-tester/profiles/lts-main-all
Testing '/home/upgrade-tester/auto-upgrade-tester/profiles/lts-main-all'
using ssh port: 54322
Port 5901 already in use. Skipping!
Port 5902 already in use. Skipping!
Port 5903 already in use. Skipping!
Port 5904 already in use. Skipping!
Port 5905 already in use. Skipping!
Port 5906 already in use. Skipping!
Port 5907 already in use. Skipping!
using VncNum: 5908
Storing the result in '/home/upgrade-tester/auto-upgrade-tester/result/lts-main-all'
2012-12-13 16:07:33.721301 log started
bootstrap()
Not bootstrapping again, we have a cached BaseImage
upgrade()
Starting for upgrade
Starting ['kvm', '-hda', '/home/upgrade-tester/auto-upgrade-tester/test-image.lts-main-all', '-monitor', 'stdio', '-localtime', '-no-reboot', '-net', 'nic,model=virtio', '-net', 'user', '-redir', 'tcp:54322::22', '-vnc', 'localhost:8', '-m', '3072']
qemu stopped unexpectedly with exit code '1'
FAILED: upgrade for '/home/upgrade-tester/auto-upgrade-tester/profiles/lts-main-all'
Failed to upgrade /home/upgrade-tester/auto-upgrade-tester/profiles/lts-main-all
Logs can be found here:
 /home/upgrade-tester/auto-upgrade-tester/result/lts-main-all/bootstrap.log
 /home/upgrade-tester/auto-upgrade-tester/result/lts-main-all/main.log
 /home/upgrade-tester/auto-upgrade-tester/result/lts-main-all/apt.log
2012-12-13 16:27:47.261625 log ended.
Duration: 0:20:13.540324
Profile '/home/upgrade-tester/auto-upgrade-tester/profiles/lts-main-all' FAILED
stop
stop pid:  <subprocess.Popen object at 0x1a5c690>
waiting for qemu to shutdown
poll() returned
qemu stopped
Releasing lock: /var/lock/auto-upgrade-tester.54322.lock
Releasing lock: /var/lock/auto-upgrade-tester.5908.lock
+ cp -ar /home/upgrade-tester/auto-upgrade-tester/result/lts-main-all/ <http://10.189.74.2:8080/job/precise-upgrade-lucid-main/./ARCH=i386,LTS=lts,PROFILE=main-all,label=upgrade-test/ws/results>
Archiving artifacts
Recording test results
No test report files were found. Configuration error?
Build step 'Publish JUnit test result report' changed build result to FAILURE



More information about the ubuntu-testing-notifications mailing list