Build failed in Jenkins: raring-adt-ubuntu-release-upgrader » amd64,adt #36

Jenkins Notification devnull at canonical.com
Thu Dec 13 11:54:01 UTC 2012


See <http://10.189.74.2:8080/job/raring-adt-ubuntu-release-upgrader/./ARCH=amd64,label=adt/36/>

------------------------------------------
[...truncated 2599 lines...]
root: DEBUG: plugins for condition 'gutsyPreCacheOpen' are '[]'
root: DEBUG: plugins for condition 'from_feistyPreCacheOpen' are '[]'
root: DEBUG: quirks: running PreCacheOpen
root: DEBUG: running Quirks.PreCacheOpen
root: DEBUG: /openCache(), new cache size 0
root: DEBUG: updateSourcesList()
root: DEBUG: rewriteSourcesList()
root: DEBUG: examining: 'deb http://archive.ubuntu.com/ubuntu/ feisty main restricted multiverse universe'
root: DEBUG: entry 'deb http://archive.ubuntu.com/ubuntu/ gutsy main restricted multiverse universe' updated to new dist
root: DEBUG: moving powerpc source entry to 'ports.ubuntu.com' 
root: DEBUG: examining: 'deb-src http://archive.ubuntu.com/ubuntu/ feisty main restricted multiverse'
root: DEBUG: entry 'deb-src http://archive.ubuntu.com/ubuntu/ gutsy main restricted multiverse' updated to new dist
root: DEBUG: examining: 'deb http://security.ubuntu.com/ubuntu/ feisty-security main restricted'
root: DEBUG: entry 'deb http://security.ubuntu.com/ubuntu/ gutsy-security main restricted' updated to new dist
root: DEBUG: moving powerpc source entry to 'ports.ubuntu.com' 
root: DEBUG: examining: 'deb http://hidden-u:hidden-p@private-ppa.launchpad.net/random-ppa feisty main'
root: DEBUG: entry '# deb http://hidden-u:hidden-p@private-ppa.launchpad.net/random-ppa gutsy main # disabled on upgrade to gutsy' was disabled (unknown mirror)
root: DEBUG: examining: 'deb https://hidden-u:hidden-p@private-ppa.launchpad.net/commercial-ppa-uploaders feisty main'
root: DEBUG: entry 'deb https://hidden-u:hidden-p@private-ppa.launchpad.net/commercial-ppa-uploaders gutsy main' updated to new dist
root: DEBUG: moving powerpc source entry to 'ports.ubuntu.com' 
root: INFO: fixing components inconsistency from 'deb http://ports.ubuntu.com/ubuntu-ports/ gutsy-security main restricted'
root: INFO: to new entry 'deb http://ports.ubuntu.com/ubuntu-ports/ gutsy-security main restricted multiverse universe'
--------------------- >> end captured logging << ---------------------

======================================================================
FAIL: test regular sources.list rewrite
----------------------------------------------------------------------
Traceback (most recent call last):
  File "/tmp/tmp.tOdgQCCSzy/dsc0-build/ubuntu-release-upgrader-0.192.1/tests/test_sources_list.py", line 76, in test_sources_list_rewrite
    """)
  File "/tmp/tmp.tOdgQCCSzy/dsc0-build/ubuntu-release-upgrader-0.192.1/tests/test_sources_list.py", line 379, in _verifySources
    (l, sources_list))
AssertionError: AssertionError: False is not true : expected entry 'deb http://archive.ubuntu.com/ubuntu/ gutsy main restricted multiverse universe' in sources.list missing. got:
'''
# main repo
deb http://ports.ubuntu.com/ubuntu-ports/ gutsy main restricted multiverse universe
deb http://ports.ubuntu.com/ubuntu-ports/ gutsy main restricted multiverse
deb-src http://archive.ubuntu.com/ubuntu/ gutsy main restricted multiverse

deb http://ports.ubuntu.com/ubuntu-ports/ gutsy-security main restricted multiverse
deb http://ports.ubuntu.com/ubuntu-ports/ gutsy-security universe

'''
-------------------- >> begin captured stdout << ---------------------
WARNING: Failed to read mirror file

--------------------- >> end captured stdout << ----------------------
-------------------- >> begin captured logging << --------------------
root: DEBUG: setting up environ for non-interactive use
root: DEBUG: Using 'DistUpgradeViewNonInteractive' view
root: DEBUG: aufsOptionsAndEnvironmentSetup()
root: DEBUG: using '/tmp/tmp.tOdgQCCSzy/dsc0t-nose-tests-testtmp/tmpdir/upgrade-rw-6xrehr' as aufs_rw_dir
root: DEBUG: using '/tmp/tmp.tOdgQCCSzy/dsc0t-nose-tests-testtmp/tmpdir/upgrade-chroot-jt0kqg' as aufs chroot dir
root: DEBUG: enable dpkg --force-overwrite
root: DEBUG: openCache()
root: DEBUG: Plugin modules in ./plugins: langpack_manual_plugin.py deb_plugin.py kdelibs4to5_plugin.py dpkg_status_plugin.py remove_lilo_plugin.py
root: DEBUG: Loading module from file ./plugins/deb_plugin.py
root: WARNING: Failed to load plugin 'deb_plugin' (invalid syntax (deb_plugin.py, line 40))
root: DEBUG: Plugins in None: 
root: DEBUG: Loading module from file ./plugins/dpkg_status_plugin.py
root: WARNING: Failed to load plugin 'dpkg_status_plugin' (cannot import name ParseTagFile)
root: DEBUG: Plugins in None: 
root: DEBUG: Loading module from file ./plugins/kdelibs4to5_plugin.py
root: WARNING: Failed to load plugin 'kdelibs4to5_plugin' (No module named 'computerjanitor')
root: DEBUG: Plugins in None: 
root: DEBUG: Loading module from file ./plugins/langpack_manual_plugin.py
root: WARNING: Failed to load plugin 'langpack_manual_plugin' (No module named 'computerjanitor')
root: DEBUG: Plugins in None: 
root: DEBUG: Loading module from file ./plugins/remove_lilo_plugin.py
root: WARNING: Failed to load plugin 'remove_lilo_plugin' (No module named 'computerjanitor')
root: DEBUG: Plugins in None: 
root: DEBUG: plugins for condition 'PreCacheOpen' are '[]'
root: DEBUG: plugins for condition 'gutsyPreCacheOpen' are '[]'
root: DEBUG: plugins for condition 'from_feistyPreCacheOpen' are '[]'
root: DEBUG: quirks: running PreCacheOpen
root: DEBUG: running Quirks.PreCacheOpen
root: DEBUG: /openCache(), new cache size 0
root: DEBUG: updateSourcesList()
root: DEBUG: rewriteSourcesList()
root: DEBUG: examining: 'deb http://archive.ubuntu.com/ubuntu/ feisty main restricted multiverse universe'
root: DEBUG: entry 'deb http://archive.ubuntu.com/ubuntu/ gutsy main restricted multiverse universe' updated to new dist
root: DEBUG: moving powerpc source entry to 'ports.ubuntu.com' 
root: DEBUG: examining: 'deb http://de.archive.ubuntu.com/ubuntu/ feisty main restricted multiverse'
root: DEBUG: entry 'deb http://de.archive.ubuntu.com/ubuntu/ gutsy main restricted multiverse' updated to new dist
root: DEBUG: moving powerpc source entry to 'ports.ubuntu.com' 
root: DEBUG: examining: 'deb-src http://archive.ubuntu.com/ubuntu/ feisty main restricted multiverse'
root: DEBUG: entry 'deb-src http://archive.ubuntu.com/ubuntu/ gutsy main restricted multiverse' updated to new dist
root: DEBUG: examining: 'deb http://security.ubuntu.com/ubuntu/ feisty-security main restricted'
root: DEBUG: entry 'deb http://security.ubuntu.com/ubuntu/ gutsy-security main restricted' updated to new dist
root: DEBUG: moving powerpc source entry to 'ports.ubuntu.com' 
root: DEBUG: examining: 'deb http://security.ubuntu.com/ubuntu/ feisty-security universe'
root: DEBUG: entry 'deb http://security.ubuntu.com/ubuntu/ gutsy-security universe' updated to new dist
root: DEBUG: moving powerpc source entry to 'ports.ubuntu.com' 
root: INFO: fixing components inconsistency from 'deb http://ports.ubuntu.com/ubuntu-ports/ gutsy-security main restricted'
root: INFO: to new entry 'deb http://ports.ubuntu.com/ubuntu-ports/ gutsy-security main restricted multiverse'
--------------------- >> end captured logging << ---------------------

======================================================================
FAIL: test transition of sparc to ports.ubuntu.com
----------------------------------------------------------------------
Traceback (most recent call last):
  File "/tmp/tmp.tOdgQCCSzy/dsc0-build/ubuntu-release-upgrader-0.192.1/tests/test_sources_list.py", line 151, in test_sparc_transition
    """)
  File "/tmp/tmp.tOdgQCCSzy/dsc0-build/ubuntu-release-upgrader-0.192.1/tests/test_sources_list.py", line 379, in _verifySources
    (l, sources_list))
AssertionError: AssertionError: False is not true : expected entry 'deb http://ports.ubuntu.com/ubuntu-ports/ hardy-security main restricted universe multiverse' in sources.list missing. got:
'''
# main repo
deb http://ports.ubuntu.com/ubuntu-ports/ hardy main restricted multiverse universe
deb http://ports.ubuntu.com/ubuntu-ports/ hardy main restricted multiverse
deb-src http://archive.ubuntu.com/ubuntu/ hardy main restricted multiverse

deb http://ports.ubuntu.com/ubuntu-ports/ hardy-security main restricted multiverse universe
'''
-------------------- >> begin captured stdout << ---------------------
WARNING: Failed to read mirror file

--------------------- >> end captured stdout << ----------------------
-------------------- >> begin captured logging << --------------------
root: DEBUG: setting up environ for non-interactive use
root: DEBUG: Using 'DistUpgradeViewNonInteractive' view
root: DEBUG: aufsOptionsAndEnvironmentSetup()
root: DEBUG: using '/tmp/tmp.tOdgQCCSzy/dsc0t-nose-tests-testtmp/tmpdir/upgrade-rw-yn51ci' as aufs_rw_dir
root: DEBUG: using '/tmp/tmp.tOdgQCCSzy/dsc0t-nose-tests-testtmp/tmpdir/upgrade-chroot-co21xa' as aufs chroot dir
root: DEBUG: enable dpkg --force-overwrite
root: DEBUG: openCache()
root: DEBUG: Plugin modules in ./plugins: langpack_manual_plugin.py deb_plugin.py kdelibs4to5_plugin.py dpkg_status_plugin.py remove_lilo_plugin.py
root: DEBUG: Loading module from file ./plugins/deb_plugin.py
root: WARNING: Failed to load plugin 'deb_plugin' (invalid syntax (deb_plugin.py, line 40))
root: DEBUG: Plugins in None: 
root: DEBUG: Loading module from file ./plugins/dpkg_status_plugin.py
root: WARNING: Failed to load plugin 'dpkg_status_plugin' (cannot import name ParseTagFile)
root: DEBUG: Plugins in None: 
root: DEBUG: Loading module from file ./plugins/kdelibs4to5_plugin.py
root: WARNING: Failed to load plugin 'kdelibs4to5_plugin' (No module named 'computerjanitor')
root: DEBUG: Plugins in None: 
root: DEBUG: Loading module from file ./plugins/langpack_manual_plugin.py
root: WARNING: Failed to load plugin 'langpack_manual_plugin' (No module named 'computerjanitor')
root: DEBUG: Plugins in None: 
root: DEBUG: Loading module from file ./plugins/remove_lilo_plugin.py
root: WARNING: Failed to load plugin 'remove_lilo_plugin' (No module named 'computerjanitor')
root: DEBUG: Plugins in None: 
root: DEBUG: plugins for condition 'PreCacheOpen' are '[]'
root: DEBUG: plugins for condition 'gutsyPreCacheOpen' are '[]'
root: DEBUG: plugins for condition 'from_feistyPreCacheOpen' are '[]'
root: DEBUG: quirks: running PreCacheOpen
root: DEBUG: running Quirks.PreCacheOpen
root: DEBUG: /openCache(), new cache size 0
root: DEBUG: updateSourcesList()
root: DEBUG: rewriteSourcesList()
root: DEBUG: examining: 'deb http://archive.ubuntu.com/ubuntu/ gutsy main restricted multiverse universe'
root: DEBUG: entry 'deb http://archive.ubuntu.com/ubuntu/ hardy main restricted multiverse universe' updated to new dist
root: DEBUG: moving sparc source entry to 'ports.ubuntu.com' 
root: DEBUG: examining: 'deb http://de.archive.ubuntu.com/ubuntu/ gutsy main restricted multiverse'
root: DEBUG: entry 'deb http://de.archive.ubuntu.com/ubuntu/ hardy main restricted multiverse' updated to new dist
root: DEBUG: moving sparc source entry to 'ports.ubuntu.com' 
root: DEBUG: examining: 'deb-src http://archive.ubuntu.com/ubuntu/ gutsy main restricted multiverse'
root: DEBUG: entry 'deb-src http://archive.ubuntu.com/ubuntu/ hardy main restricted multiverse' updated to new dist
root: DEBUG: examining: 'deb http://security.ubuntu.com/ubuntu gutsy-security main restricted'
root: DEBUG: entry 'deb http://security.ubuntu.com/ubuntu hardy-security main restricted' updated to new dist
root: DEBUG: moving sparc source entry to 'ports.ubuntu.com' 
root: INFO: fixing components inconsistency from 'deb http://ports.ubuntu.com/ubuntu-ports/ hardy-security main restricted'
root: INFO: to new entry 'deb http://ports.ubuntu.com/ubuntu-ports/ hardy-security main restricted multiverse universe'
--------------------- >> end captured logging << ---------------------

======================================================================
FAIL: test transition of apt-cacher/apt-torrent uris
----------------------------------------------------------------------
Traceback (most recent call last):
  File "/tmp/tmp.tOdgQCCSzy/dsc0-build/ubuntu-release-upgrader-0.192.1/tests/test_sources_list.py", line 349, in test_unicode_comments
    """)
  File "/tmp/tmp.tOdgQCCSzy/dsc0-build/ubuntu-release-upgrader-0.192.1/tests/test_sources_list.py", line 379, in _verifySources
    (l, sources_list))
AssertionError: AssertionError: False is not true : expected entry 'deb http://archive.ubuntu.com/ubuntu gutsy main restricted' in sources.list missing. got:
'''deb http://ports.ubuntu.com/ubuntu-ports/ gutsy main restricted
deb http://ports.ubuntu.com/ubuntu-ports/ gutsy-updates main restricted
deb http://ports.ubuntu.com/ubuntu-ports/ gutsy-security main restricted
# A PPA with a unicode comment
# deb http://ppa.launchpad.net/random-ppa quantal main # ppa of Víctor R. Ruiz (vrruiz) disabled on upgrade to gutsy
'''
-------------------- >> begin captured stdout << ---------------------
WARNING: Failed to read mirror file

--------------------- >> end captured stdout << ----------------------
-------------------- >> begin captured logging << --------------------
root: DEBUG: setting up environ for non-interactive use
root: DEBUG: Using 'DistUpgradeViewNonInteractive' view
root: DEBUG: aufsOptionsAndEnvironmentSetup()
root: DEBUG: using '/tmp/tmp.tOdgQCCSzy/dsc0t-nose-tests-testtmp/tmpdir/upgrade-rw-scr12u' as aufs_rw_dir
root: DEBUG: using '/tmp/tmp.tOdgQCCSzy/dsc0t-nose-tests-testtmp/tmpdir/upgrade-chroot-kl5ld9' as aufs chroot dir
root: DEBUG: enable dpkg --force-overwrite
root: DEBUG: openCache()
root: DEBUG: Plugin modules in ./plugins: langpack_manual_plugin.py deb_plugin.py kdelibs4to5_plugin.py dpkg_status_plugin.py remove_lilo_plugin.py
root: DEBUG: Loading module from file ./plugins/deb_plugin.py
root: WARNING: Failed to load plugin 'deb_plugin' (invalid syntax (deb_plugin.py, line 40))
root: DEBUG: Plugins in None: 
root: DEBUG: Loading module from file ./plugins/dpkg_status_plugin.py
root: WARNING: Failed to load plugin 'dpkg_status_plugin' (cannot import name ParseTagFile)
root: DEBUG: Plugins in None: 
root: DEBUG: Loading module from file ./plugins/kdelibs4to5_plugin.py
root: WARNING: Failed to load plugin 'kdelibs4to5_plugin' (No module named 'computerjanitor')
root: DEBUG: Plugins in None: 
root: DEBUG: Loading module from file ./plugins/langpack_manual_plugin.py
root: WARNING: Failed to load plugin 'langpack_manual_plugin' (No module named 'computerjanitor')
root: DEBUG: Plugins in None: 
root: DEBUG: Loading module from file ./plugins/remove_lilo_plugin.py
root: WARNING: Failed to load plugin 'remove_lilo_plugin' (No module named 'computerjanitor')
root: DEBUG: Plugins in None: 
root: DEBUG: plugins for condition 'PreCacheOpen' are '[]'
root: DEBUG: plugins for condition 'gutsyPreCacheOpen' are '[]'
root: DEBUG: plugins for condition 'from_feistyPreCacheOpen' are '[]'
root: DEBUG: quirks: running PreCacheOpen
root: DEBUG: running Quirks.PreCacheOpen
root: DEBUG: /openCache(), new cache size 0
root: DEBUG: updateSourcesList()
root: DEBUG: rewriteSourcesList()
root: DEBUG: examining: 'deb http://archive.ubuntu.com/ubuntu gutsy main restricted'
root: DEBUG: entry 'deb http://archive.ubuntu.com/ubuntu gutsy main restricted' is already set to new dist
root: DEBUG: moving sparc source entry to 'ports.ubuntu.com' 
root: DEBUG: examining: 'deb http://archive.ubuntu.com/ubuntu gutsy-updates main restricted'
root: DEBUG: entry 'deb http://archive.ubuntu.com/ubuntu gutsy-updates main restricted' is already set to new dist
root: DEBUG: moving sparc source entry to 'ports.ubuntu.com' 
root: DEBUG: examining: 'deb http://security.ubuntu.com/ubuntu/ gutsy-security main restricted'
root: DEBUG: entry 'deb http://security.ubuntu.com/ubuntu/ gutsy-security main restricted' is already set to new dist
root: DEBUG: moving sparc source entry to 'ports.ubuntu.com' 
root: DEBUG: examining: 'deb http://ppa.launchpad.net/random-ppa quantal main # ppa of Víctor R. Ruiz (vrruiz)'
root: DEBUG: entry '# deb http://ppa.launchpad.net/random-ppa quantal main # ppa of Víctor R. Ruiz (vrruiz) disabled on upgrade to gutsy' was disabled (unknown mirror)
--------------------- >> end captured logging << ---------------------

----------------------------------------------------------------------
Ran 38 tests in 521.207s

FAILED (failures=9)
adt-run: trace: & dsc0t-nose-tests: ----------------------------------------]
adt-run: trace1: ** needs_reset, previously=False
adt-run: trace: @@@@@@@@@@@@@@@@@@@@@@@@@@@@@@@@@@@@@@@@ tests done.
adt-run: trace: ** stop
adt-run: trace: ** close, scratch=tb-scratch~/tmp/tmp.tOdgQCCSzy:-/|/tmp/tmp.tOdgQCCSzy/!
2012-12-13 11:53:31 AM: Failure: adt-run exited with status 4.
Pseudo-terminal will not be allocated because stdin is not a terminal.
Warning: Permanently added '[localhost]:54323' (ECDSA) to the list of known hosts.
find: `./.autopkgtest/gpg': Permission denied
2012-12-13 11:54:00 AM: Info: Test artifacts copied to <http://10.189.74.2:8080/job/raring-adt-ubuntu-release-upgrader/./ARCH=amd64,label=adt/ws/results>
2012-12-13 11:54:00 AM: Info: Updating Jenkins results
Pseudo-terminal will not be allocated because stdin is not a terminal.
Warning: Permanently added '[localhost]:54323' (ECDSA) to the list of known hosts.
2012-12-13 11:54:01 AM: Info: Cleaning up
Build step 'Execute shell' marked build as failure
Archiving artifacts



More information about the ubuntu-testing-notifications mailing list