Build failed in Jenkins: quantal-proposed-adt-software-center » i386,albali #18

Jenkins Notification devnull at canonical.com
Tue Nov 20 21:21:41 UTC 2012


See <http://10.189.74.2:8080/job/quantal-proposed-adt-software-center/./ARCH=i386,label=albali/18/>

------------------------------------------
[...truncated 2430 lines...]
    bus = cls._new_for_bus(address_or_type, mainloop=mainloop)
dbus.exceptions.DBusException: org.freedesktop.DBus.Error.NoServer: Failed to connect to socket /tmp/dbus-BaX6OuM3lt: Connection refused
ok
test_idle_timeout_updates (tests.test_dataprovider.IdleTimeoutTestCase) ... ok
test_empty_dict_set (tests.test_dataprovider.PropertyDictExceptionsTestCase) ... ok
test_normal_dict (tests.test_dataprovider.PropertyDictExceptionsTestCase) ... ok
test_normal_set (tests.test_dataprovider.PropertyDictExceptionsTestCase) ... ok
test_simple (tests.test_dataprovider.PropertyDictExceptionsTestCase) ... ok

======================================================================
FAIL: test_get_details (tests.test_dataprovider.DataProviderTestCase)
----------------------------------------------------------------------
Traceback (most recent call last):
  File "tests/test_dataprovider.py", line 136, in test_get_details
    self.assertEqual(result["is_desktop_dependency"], True)
AssertionError: False != True

----------------------------------------------------------------------
Ran 15 tests in 7.347s

FAILED (failures=1)
Traceback (most recent call last):
  File "/tmp/tmp.9mNA1zlQOH/dsc0-build/software-center-5.4.1.2/data/update-software-center-agent", line 112, in <module>
    if not update_from_software_center_agent(db, cache, options.ignore_cache, include_sca_qa):
  File "./softwarecenter/db/update.py", line 1061, in update_from_software_center_agent
    token = helper.find_oauth_token_sync()
  File "./softwarecenter/backend/ubuntusso.py", line 138, in find_oauth_token_sync
    sso = self. _get_login_backend_and_connect()
  File "./softwarecenter/backend/ubuntusso.py", line 130, in _get_login_backend_and_connect
    _(SOFTWARE_CENTER_SSO_DESCRIPTION))
  File "./softwarecenter/backend/login.py", line 80, in get_login_backend
    sso_class = LoginBackendDbusSSO(window_id, appname, help_text)
  File "./softwarecenter/backend/login_impl/login_sso.py", line 46, in __init__
    self.bus = dbus.SessionBus()
  File "/usr/lib/python2.7/dist-packages/dbus/_dbus.py", line 211, in __new__
    mainloop=mainloop)
  File "/usr/lib/python2.7/dist-packages/dbus/_dbus.py", line 100, in __new__
    bus = BusConnection.__new__(subclass, bus_type, mainloop=mainloop)
  File "/usr/lib/python2.7/dist-packages/dbus/bus.py", line 122, in __new__
    bus = cls._new_for_bus(address_or_type, mainloop=mainloop)
dbus.exceptions.DBusException: org.freedesktop.DBus.Error.NoServer: Failed to connect to socket /tmp/dbus-BaX6OuM3lt: Connection refused
Traceback (most recent call last):
  File "/usr/lib/python2.7/runpy.py", line 162, in _run_module_as_main
    "__main__", fname, loader, pkg_name)
  File "/usr/lib/python2.7/runpy.py", line 72, in _run_code
    exec code in run_globals
  File "/usr/lib/python2.7/unittest/__main__.py", line 12, in <module>
    main(module=None)
  File "/usr/lib/python2.7/unittest/main.py", line 94, in __init__
    self.parseArgs(argv)
  File "/usr/lib/python2.7/unittest/main.py", line 149, in parseArgs
    self.createTests()
  File "/usr/lib/python2.7/unittest/main.py", line 158, in createTests
    self.module)
  File "/usr/lib/python2.7/unittest/loader.py", line 128, in loadTestsFromNames
    suites = [self.loadTestsFromName(name, module) for name in names]
  File "/usr/lib/python2.7/unittest/loader.py", line 91, in loadTestsFromName
    module = __import__('.'.join(parts_copy))
  File "tests/test_origin.py", line 13, in <module>
    class TestOrigins(unittest.TestCase):
  File "tests/test_origin.py", line 17, in TestOrigins
    url_accessable("http://de.archive.ubuntu.com/ubuntu", "dists/"),
  File "tests/utils.py", line 64, in url_accessable
    f = urlopen(url)
  File "/usr/lib/python2.7/urllib2.py", line 127, in urlopen
    return _opener.open(url, data, timeout)
  File "/usr/lib/python2.7/urllib2.py", line 401, in open
    response = self._open(req, data)
  File "/usr/lib/python2.7/urllib2.py", line 419, in _open
    '_open', req)
  File "/usr/lib/python2.7/urllib2.py", line 379, in _call_chain
    result = func(*args)
  File "/usr/lib/python2.7/urllib2.py", line 1211, in http_open
    return self.do_open(httplib.HTTPConnection, req)
  File "/usr/lib/python2.7/urllib2.py", line 1181, in do_open
    raise URLError(err)
urllib2.URLError: <urlopen error [Errno 111] Connection refused>
test_fake_aptd (tests.test_testutils.DummyBackendTestUtilsTestCase) ... 21:09:26 AptDaemon [INFO]: Initializing daemon
21:09:26 AptDaemon [INFO]: Quitting was requested
ok
test_start_stop_dummy_backend (tests.test_testutils.DummyBackendTestUtilsTestCase) ... FAIL
test_app_properties_helper_mock_with_custom_values (tests.test_testutils.TestUtilsTestCase) ... ok
test_app_properties_helper_mock_with_defaults (tests.test_testutils.TestUtilsTestCase) ... ok
test_url_accessable (tests.test_testutils.TestUtilsTestCase) ... ok

======================================================================
FAIL: test_start_stop_dummy_backend (tests.test_testutils.DummyBackendTestUtilsTestCase)
----------------------------------------------------------------------
Traceback (most recent call last):
  File "tests/test_testutils.py", line 40, in test_start_stop_dummy_backend
    self.assertEqual(len(names), 6)
AssertionError: 4 != 6

----------------------------------------------------------------------
Ran 5 tests in 1.969s

FAILED (failures=1)
ERROR:root:Could not find any typelib for Gst
WARNING:root:failed to init network state watcher 'org.freedesktop.DBus.Error.ServiceUnknown: The name org.freedesktop.NetworkManager was not provided by any .service files'
WARNING:softwarecenter.fixme:logs to the root logger: '('softwarecenter/netstatus.py', 122, '__init_network_state')'
2012-11-20 21:16:33,725 - softwarecenter.fixme - WARNING - logs to the root logger: '('softwarecenter/netstatus.py', 122, '__init_network_state')'
2012-11-20 21:16:33,725 - root - WARNING - failed to init network state watcher 'org.freedesktop.DBus.Error.ServiceUnknown: The name org.freedesktop.NetworkManager was not provided by any .service files'
INFO:root:Attempting one time ping of archive.ubuntu.com to test if internet connectivity exists.
WARNING:softwarecenter.fixme:logs to the root logger: '('softwarecenter/netstatus.py', 151, 'test_ping')'
2012-11-20 21:16:33,830 - softwarecenter.fixme - WARNING - logs to the root logger: '('softwarecenter/netstatus.py', 151, 'test_ping')'
test_hardware_requirements_box (tests.gtk3.test_widgets.TestHWRequirements)2012-11-20 21:16:33,828 - root - INFO - Attempting one time ping of archive.ubuntu.com to test if internet connectivity exists.
 ... ok
test_hardware_requirements_label (tests.gtk3.test_widgets.TestHWRequirements) ... ok
test_hardware_requirements_label_utf8 (tests.gtk3.test_widgets.TestHWRequirements) ... ok
test_reviews_includes_any_language (tests.gtk3.test_widgets.TestUIReviewsList) ... ok
test_reviews_no_reviews_but_app_not_installed (tests.gtk3.test_widgets.TestUIReviewsList) ... ok
test_reviews_no_reviews_offer_to_write_one (tests.gtk3.test_widgets.TestUIReviewsList) ... ok
test_reviews_offers_to_relax_language (tests.gtk3.test_widgets.TestUIReviewsList) ... ok
test_actionbar (tests.gtk3.test_widgets.TestWidgets) ... ok
test_apptreeview (tests.gtk3.test_widgets.TestWidgets) ... INFO:softwarecenter.db.pkginfo_impl.aptcache:aptcache.open()
2012-11-20 21:16:34,703 - softwarecenter.db.pkginfo_impl.aptcache - INFO - aptcache.open()
INFO:softwarecenter.db.pkginfo_impl.aptcache:aptcache.open()
2012-11-20 21:16:35,209 - softwarecenter.db.pkginfo_impl.aptcache - INFO - aptcache.open()
INFO:softwarecenter.db.database:open() database: path=None use_axi=True use_agent=True
2012-11-20 21:16:35,700 - softwarecenter.db.database - INFO - open() database: path=None use_axi=True use_agent=True
WARNING:softwarecenter.region:failed to use geoclue: 'org.freedesktop.DBus.Error.ServiceUnknown: The name org.freedesktop.Geoclue.Master was not provided by any .service files'
2012-11-20 21:16:35,721 - softwarecenter.region - WARNING - failed to use geoclue: 'org.freedesktop.DBus.Error.ServiceUnknown: The name org.freedesktop.Geoclue.Master was not provided by any .service files'
ok
test_backforward (tests.gtk3.test_widgets.TestWidgets) ... ok
test_backforward_lp1034894 (tests.gtk3.test_widgets.TestWidgets) ... ok
test_buttons (tests.gtk3.test_widgets.TestWidgets) ... ok
test_containers (tests.gtk3.test_widgets.TestWidgets) ... ok
test_description (tests.gtk3.test_widgets.TestWidgets) ... ok
test_exhibits (tests.gtk3.test_widgets.TestWidgets) ... ok
test_screenshot_thumbnail (tests.gtk3.test_widgets.TestWidgets) ... INFO:softwarecenter.db.pkginfo_impl.aptcache:aptcache.open()
2012-11-20 21:16:42,463 - softwarecenter.db.pkginfo_impl.aptcache - INFO - aptcache.open()
INFO:softwarecenter.db.database:open() database: path=None use_axi=True use_agent=True
2012-11-20 21:16:43,058 - softwarecenter.db.database - INFO - open() database: path=None use_axi=True use_agent=True
WARNING:softwarecenter.simplefiledownloader:url changed from 'http://screenshots.ubuntu.com/screenshot-with-version/totem/3.4.3-0ubuntu5' to 'http://screenshots.ubuntu.com/screenshot-with-version/comix/4.0.4-1'
2012-11-20 21:16:43,072 - softwarecenter.simplefiledownloader - WARNING - url changed from 'http://screenshots.ubuntu.com/screenshot-with-version/totem/3.4.3-0ubuntu5' to 'http://screenshots.ubuntu.com/screenshot-with-version/comix/4.0.4-1'
FAIL
test_searchentry (tests.gtk3.test_widgets.TestWidgets) ... ok
test_show_image_dialog (tests.gtk3.test_widgets.TestWidgets) ... ok
test_spinner (tests.gtk3.test_widgets.TestWidgets) ... ok
test_stars (tests.gtk3.test_widgets.TestWidgets) ... ok
test_symbolic_icons (tests.gtk3.test_widgets.TestWidgets) ... ok
test_videoplayer (tests.gtk3.test_widgets.TestWidgets) ... ok
test_stop (tests.gtk3.test_widgets.VideoPlayerTestCase) ... ok
test_uri (tests.gtk3.test_widgets.VideoPlayerTestCase) ... ok

======================================================================
FAIL: test_screenshot_thumbnail (tests.gtk3.test_widgets.TestWidgets)
----------------------------------------------------------------------
Traceback (most recent call last):
  File "tests/gtk3/test_widgets.py", line 129, in test_screenshot_thumbnail
    t.spinner.get_property("visible"))
AssertionError: False is not true

----------------------------------------------------------------------
Ran 24 tests in 9.925s

FAILED (failures=1)
INFO:root:ping output: 'Internet connection available!
PING archive.ubuntu.com (91.189.92.200) 56(84) bytes of data.

--- archive.ubuntu.com ping statistics ---
1 packets transmitted, 0 received, 100% packet loss, time 0ms

'
WARNING:softwarecenter.fixme:logs to the root logger: '('softwarecenter/netstatus.py', 168, 'test_ping')'
2012-11-20 21:16:43,852 - softwarecenter.fixme - WARNING - logs to the root logger: '('softwarecenter/netstatus.py', 168, 'test_ping')'
2012-11-20 21:16:43,852 - root - INFO - ping output: 'Internet connection available!
PING archive.ubuntu.com (91.189.92.200) 56(84) bytes of data.

--- archive.ubuntu.com ping statistics ---
1 packets transmitted, 0 received, 100% packet loss, time 0ms

'
+ exit 1
adt-run: trace: & dsc0t-run-tests: ----------------------------------------]
adt-run: trace1: ** needs_reset, previously=False
adt-run: trace: @@@@@@@@@@@@@@@@@@@@@@@@@@@@@@@@@@@@@@@@ tests done.
adt-run: trace: ** stop
adt-run: trace: ** close, scratch=tb-scratch~/tmp/tmp.9mNA1zlQOH:-/|/tmp/tmp.9mNA1zlQOH/!
+ RC=4
+ [ 0 -eq 1 ]
+ chown -R ubuntu /home/ubuntu/adt-log
+ chmod og+r /var/log/syslog
+ chmod og+r /var/crash/_usr_lib_python3.2_unittest___init__.py.1000.crash
+ exit 4
+ RET=4
+ [ 0 -eq 1 ]
+ [ 4 -gt 0 ]
+ log_failure_msg adt-run exited with status 4.
+ log_msg Failure: adt-run exited with status 4.\n
+ date +%F %X
+ printf 2012-11-20 21:21:33: Failure: adt-run exited with status 4.\n
2012-11-20 21:21:33: Failure: adt-run exited with status 4.
+ [ 0 -eq 0 ]
+ mkdir -p <http://10.189.74.2:8080/job/quantal-proposed-adt-software-center/./ARCH=i386,label=albali/ws/results>
+ ssh -o UserKnownHostsFile=/dev/null -o StrictHostKeyChecking=no -o CheckHostIP=no -i /var/cache/adt/disks/adtkey -p 54327 -t -o BatchMode=yes -l ubuntu localhost sudo chown -R ubuntu /home/ubuntu/adt-log; find  -type f -empty | xargs rm
Pseudo-terminal will not be allocated because stdin is not a terminal.
Warning: Permanently added '[localhost]:54327' (ECDSA) to the list of known hosts.
sudo: unable to resolve host autopkgtest
find: `./.autopkgtest/gpg': Permission denied
+ scp -r -o UserKnownHostsFile=/dev/null -o StrictHostKeyChecking=no -o CheckHostIP=no -i /var/cache/adt/disks/adtkey -P 54327 ubuntu at localhost:/home/ubuntu/adt-log/*
    /var/crash/*crash /var/log/syslog <http://10.189.74.2:8080/job/quantal-proposed-adt-software-center/./ARCH=i386,label=albali/ws/results>
+ true
+ log_info_msg Test artifacts copied to <http://10.189.74.2:8080/job/quantal-proposed-adt-software-center/./ARCH=i386,label=albali/ws/results>
+ log_msg Info: Test artifacts copied to <http://10.189.74.2:8080/job/quantal-proposed-adt-software-center/./ARCH=i386,label=albali/ws/results\n>
+ date +%F %X
+ printf 2012-11-20 21:21:39: Info: Test artifacts copied to <http://10.189.74.2:8080/job/quantal-proposed-adt-software-center/./ARCH=i386,label=albali/ws/results\n>
2012-11-20 21:21:39: Info: Test artifacts copied to <http://10.189.74.2:8080/job/quantal-proposed-adt-software-center/./ARCH=i386,label=albali/ws/results>
+ [ -n 2012-11-20_20-21-45 ]
+ log_info_msg Updating Jenkins results
+ log_msg Info: Updating Jenkins results\n
+ date +%F %X
+ printf 2012-11-20 21:21:39: Info: Updating Jenkins results\n
2012-11-20 21:21:39: Info: Updating Jenkins results
+ res=fail
+ [ 4 -eq 0 ]
+ OPTS=-d
+ [ 1 -eq 1 ]
+ OPTS=-d -P
+ /var/lib/ubuntu-iso-testing/auto-package-testing/bin/../jenkins/update-adt-result -d -P -r quantal software-center i386 fail
2012-11-20 21:21:39,931 DEBUG Debug mode enabled
2012-11-20 21:21:39,932 DEBUG aptroot: /var/lib/ubuntu-iso-testing/auto-package-testing/aptroot/quantal-proposed-amd64
2012-11-20 21:21:39,932 DEBUG Loading status from /var/lib/ubuntu-iso-testing/auto-package-testing/aptroot/quantal-proposed-amd64/var/cache/adt/quantal-proposed_amd64_software-center
2012-11-20 21:21:39,932 DEBUG Writing status file
2012-11-20 21:21:39,933 INFO Writing results to /var/lib/ubuntu-iso-testing/auto-package-testing/aptroot/quantal-proposed-amd64/../quantal/quantal-proposed_software-center_20121120-212139
+ [ 0 -eq 0 ]
+ ssh -o UserKnownHostsFile=/dev/null -o StrictHostKeyChecking=no -o CheckHostIP=no -i /var/cache/adt/disks/adtkey -p 54327 -t -o BatchMode=yes -l ubuntu localhost sudo poweroff
Pseudo-terminal will not be allocated because stdin is not a terminal.
Warning: Permanently added '[localhost]:54327' (ECDSA) to the list of known hosts.
sudo: unable to resolve host autopkgtest
+ exit 4
+ on_exit
+ log_info_msg Cleaning up
+ log_msg Info: Cleaning up\n
+ date +%F %X
+ printf 2012-11-20 21:21:40: Info: Cleaning up\n
2012-11-20 21:21:40: Info: Cleaning up
+ [ -f /dev/shm/adt/quantal-i386-software-center-20121120_205239.img.pid ]
+ cat /dev/shm/adt/quantal-i386-software-center-20121120_205239.img.pid
+ kill -9 110665
+ rm -f /dev/shm/adt/quantal-i386-software-center-20121120_205239.img.pid
+ rm -f /dev/shm/adt/quantal-i386-software-center-20121120_205239.img
+ rm -f /var/lock/adt/ssh.54327.lock
+ rm -f /var/lock/adt/vnc.5915.lock
+ [ -d /tmp/adt-i386.VoBWv1 ]
+ rm -Rf /tmp/adt-i386.VoBWv1
+ exit 4
Build step 'Execute shell' marked build as failure
Archiving artifacts



More information about the ubuntu-testing-notifications mailing list