Build failed in Jenkins: raring-proposed-adt-ubuntu-drivers-common » amd64,albali #14

Jenkins Notification devnull at canonical.com
Tue Nov 20 13:04:58 UTC 2012


See <http://10.189.74.2:8080/job/raring-proposed-adt-ubuntu-drivers-common/./ARCH=amd64,label=albali/14/>

------------------------------------------
[...truncated 814 lines...]
Get:7 http://archive.ubuntu.com/ubuntu/ raring/universe nvidia-common amd64 1:0.2.72 [1,278 B]
Preconfiguring packages ...
Fetched 2,955 kB in 9s (307 kB/s)
Selecting previously unselected package libasound2:amd64.
(Reading database ... 64117 files and directories currently installed.)
Unpacking libasound2:amd64 (from .../libasound2_1.0.25-4ubuntu1_amd64.deb) ...
Selecting previously unselected package libsamplerate0:amd64.
Unpacking libsamplerate0:amd64 (from .../libsamplerate0_0.1.8-5_amd64.deb) ...
Selecting previously unselected package python3-xkit.
Unpacking python3-xkit (from .../python3-xkit_0.5.0ubuntu1_all.deb) ...
Selecting previously unselected package alsa-utils.
Unpacking alsa-utils (from .../alsa-utils_1.0.25-3ubuntu2_amd64.deb) ...
Selecting previously unselected package ubuntu-drivers-common.
Unpacking ubuntu-drivers-common (from .../ubuntu-drivers-common_1%3a0.2.72_amd64.deb) ...
Selecting previously unselected package dh-modaliases.
Unpacking dh-modaliases (from .../dh-modaliases_1%3a0.2.72_all.deb) ...
Selecting previously unselected package nvidia-common.
Unpacking nvidia-common (from .../nvidia-common_1%3a0.2.72_amd64.deb) ...
Processing triggers for man-db ...
Processing triggers for ureadahead ...
Setting up libasound2:amd64 (1.0.25-4ubuntu1) ...
Setting up libsamplerate0:amd64 (0.1.8-5) ...
Setting up python3-xkit (0.5.0ubuntu1) ...
Setting up alsa-utils (1.0.25-3ubuntu2) ...
Setting up dh-modaliases (1:0.2.72) ...
Processing triggers for ureadahead ...
Setting up ubuntu-drivers-common (1:0.2.72) ...
Processing triggers for ureadahead ...
Setting up nvidia-common (1:0.2.72) ...
Processing triggers for libc-bin ...
ldconfig deferred processing now taking place
 -> Finished parsing the build-deps
adt-run: trace: & dsc0t-system: [----------------------------------------
+ buildtree=/tmp/tmp.3oNEB78QQK/dsc0-build/ubuntu-drivers-common-0.2.72/
+ shift
+ rm -rf -- /tmp/tmp.3oNEB78QQK/dsc0t-system-testtmp /tmp/tmp.3oNEB78QQK/dsc0t-system-testtmp/tmpdir /tmp/tmp.3oNEB78QQK/dsc0t-system-testtmp/adttmp
+ mkdir -- /tmp/tmp.3oNEB78QQK/dsc0t-system-testtmp /tmp/tmp.3oNEB78QQK/dsc0t-system-testtmp/tmpdir /tmp/tmp.3oNEB78QQK/dsc0t-system-testtmp/adttmp
adt-run: trace: & dsc0t-system:  - - - - - - - - - - results - - - - - - - - - -
dsc0t-system         FAIL non-zero exit status 1
adt-run: trace: & dsc0t-system:  - - - - - - - - - - stdout - - - - - - - - - -
test_debug (__main__.TestSystem)
ubuntu-drivers debug succeeds ... ok
test_list (__main__.TestSystem)
ubuntu-drivers list succeeds ... ok
test_bcmwl (__main__.TestUbuntuDrivers)
bcmwl-kernel-source ... FAIL
test_fglrx (__main__.TestUbuntuDrivers)
fglrx ... 
--- Error output from package installation ---

Extracting templates from packages: 85%
Extracting templates from packages: 100%
update-alternatives: warning: forcing reinstallation of alternative /usr/lib/fglrx/ld.so.conf because link group x86_64-linux-gnu_gl_conf is broken
Traceback (most recent call last):
  File "/usr/share/apport/package-hooks/dkms_packages.py", line 22, in <module>
    import apport
ImportError: No module named apport
Error! Bad return status for module build on kernel: 3.7.0-2-generic (x86_64)
Consult /var/lib/dkms/fglrx/9.000/build/make.log for more information.
modprobe: ../tools/modprobe.c:550: print_action: Assertion `kmod_module_get_initstate(m) == KMOD_MODULE_BUILTIN' failed.
Aborted (core dumped)
WARNING: could not open /tmp/tmp.3oNEB78QQK/dsc0t-system-testtmp/tmpdir/mkinitramfs_KNYFN9/lib/modules/3.7.0-2-generic/modules.builtin: No such file or directory

------
FAIL
test_fglrx_updates (__main__.TestUbuntuDrivers)
fglrx-updates ... 
--- Error output from package installation ---

Extracting templates from packages: 85%
Extracting templates from packages: 100%
update-alternatives: warning: forcing reinstallation of alternative /usr/lib/fglrx/ld.so.conf because link group x86_64-linux-gnu_gl_conf is broken
modprobe: ../tools/modprobe.c:550: print_action: Assertion `kmod_module_get_initstate(m) == KMOD_MODULE_BUILTIN' failed.
Aborted (core dumped)
WARNING: could not open /tmp/tmp.3oNEB78QQK/dsc0t-system-testtmp/tmpdir/mkinitramfs_ZbH0LQ/lib/modules/3.7.0-2-generic/modules.builtin: No such file or directory

------
ok
test_nvidia_current (__main__.TestUbuntuDrivers)
nvidia-current ... 
--- Error output from package installation ---

Extracting templates from packages: 30%
Extracting templates from packages: 61%
Extracting templates from packages: 91%
Extracting templates from packages: 100%
adduser: Warning: The home directory `/var/lib/colord' does not belong to the user you are currently creating.
INFO:Enable nvidia-current
DEBUG:Parsing /usr/share/ubuntu-drivers-common/quirks/lenovo_thinkpad
DEBUG:Parsing /usr/share/ubuntu-drivers-common/quirks/put_your_quirks_here
DEBUG:Parsing /usr/share/ubuntu-drivers-common/quirks/dell_latitude
DEBUG:Processing quirk ThinkPad T420s
DEBUG:Failure to match Bochs with LENOVO
DEBUG:Quirk doesn't match
DEBUG:Processing quirk Latitude E6530
DEBUG:Failure to match Bochs with Latitude E6530
DEBUG:Quirk doesn't match
modprobe: ../tools/modprobe.c:550: print_action: Assertion `kmod_module_get_initstate(m) == KMOD_MODULE_BUILTIN' failed.
Aborted (core dumped)
WARNING: could not open /tmp/tmp.3oNEB78QQK/dsc0t-system-testtmp/tmpdir/mkinitramfs_ER2T30/lib/modules/3.7.0-2-generic/modules.builtin: No such file or directory

------
ok
test_nvidia_current_updates (__main__.TestUbuntuDrivers)
nvidia-current-updates ... 
--- Error output from package installation ---

Extracting templates from packages: 53%
Extracting templates from packages: 100%
INFO:Enable nvidia-current-updates
DEBUG:Parsing /usr/share/ubuntu-drivers-common/quirks/lenovo_thinkpad
DEBUG:Parsing /usr/share/ubuntu-drivers-common/quirks/put_your_quirks_here
DEBUG:Parsing /usr/share/ubuntu-drivers-common/quirks/dell_latitude
DEBUG:Processing quirk ThinkPad T420s
DEBUG:Failure to match Bochs with LENOVO
DEBUG:Quirk doesn't match
DEBUG:Processing quirk Latitude E6530
DEBUG:Failure to match Bochs with Dell Inc.
DEBUG:Quirk doesn't match
update-alternatives: warning: alternative /usr/lib/nvidia-settings/ld.so.conf (part of link group nvidia_settings_conf) doesn't exist; removing from list of alternatives
update-alternatives: warning: /etc/alternatives/nvidia_settings_conf is dangling; it will be updated with best choice
modprobe: ../tools/modprobe.c:550: print_action: Assertion `kmod_module_get_initstate(m) == KMOD_MODULE_BUILTIN' failed.
Aborted (core dumped)
WARNING: could not open /tmp/tmp.3oNEB78QQK/dsc0t-system-testtmp/tmpdir/mkinitramfs_Kdkbt1/lib/modules/3.7.0-2-generic/modules.builtin: No such file or directory

------
ok
test_sl_modem (__main__.TestUbuntuDrivers)
sl-modem-dkms ... ok
test_virtualbox (__main__.TestUbuntuDrivers)
virtualbox-dkms ... 
--- Error output from package installation ---

Extracting templates from packages: 63%
Extracting templates from packages: 100%
invoke-rc.d: initscript virtualbox, action "restart" failed.

------
ok

======================================================================
FAIL: test_bcmwl (__main__.TestUbuntuDrivers)
bcmwl-kernel-source
----------------------------------------------------------------------
Traceback (most recent call last):
  File "/tmp/tmp.3oNEB78QQK/dsc0-build/ubuntu-drivers-common-0.2.72/debian/tests/system", line 80, in test_bcmwl
    'bcmwl-kernel-source', 'wl', auto_install=True)
  File "/tmp/tmp.3oNEB78QQK/dsc0-build/ubuntu-drivers-common-0.2.72/debian/tests/system", line 129, in do_test_driver
    o = program_out_success(['ubuntu-drivers', 'autoinstall'], self)
  File "/tmp/tmp.3oNEB78QQK/dsc0-build/ubuntu-drivers-common-0.2.72/debian/tests/system", line 25, in program_out_success
    self.assertEqual(err, '')
AssertionError: 'WARNING: could not open /tmp/tmp.3oNEB78QQK/dsc0t-system-testtmp/tmpdir/mkinitr [truncated]... != ''
- WARNING: could not open /tmp/tmp.3oNEB78QQK/dsc0t-system-testtmp/tmpdir/mkinitramfs_7QKmjc/lib/modules/3.7.0-2-generic/modules.builtin: No such file or directory


======================================================================
FAIL: test_fglrx (__main__.TestUbuntuDrivers)
fglrx
----------------------------------------------------------------------
Traceback (most recent call last):
  File "/tmp/tmp.3oNEB78QQK/dsc0-build/ubuntu-drivers-common-0.2.72/debian/tests/system", line 100, in test_fglrx
    'fglrx', 'fglrx', auto_install=False)
  File "/tmp/tmp.3oNEB78QQK/dsc0-build/ubuntu-drivers-common-0.2.72/debian/tests/system", line 143, in do_test_driver
    o = program_out_success(['modinfo', module], self)
  File "/tmp/tmp.3oNEB78QQK/dsc0-build/ubuntu-drivers-common-0.2.72/debian/tests/system", line 25, in program_out_success
    self.assertEqual(err, '')
AssertionError: 'ERROR: Module fglrx not found.\n' != ''
- ERROR: Module fglrx not found.


----------------------------------------------------------------------
Ran 9 tests in 1416.351s

FAILED (failures=2)
adt-run: trace: & dsc0t-system: ----------------------------------------]
adt-run: trace1: ** needs_reset, previously=False
adt-run: trace: @@@@@@@@@@@@@@@@@@@@@@@@@@@@@@@@@@@@@@@@ tests done.
adt-run: trace: ** stop
adt-run: trace: ** close, scratch=tb-scratch~/tmp/tmp.3oNEB78QQK:-/|/tmp/tmp.3oNEB78QQK/!
+ RC=4
+ [ 0 -eq 1 ]
+ chown -R ubuntu /home/ubuntu/adt-log
+ chmod og+r /var/log/syslog
+ chmod og+r /var/crash/_bin_kmod.0.crash
+ exit 4
+ RET=4
+ [ 0 -eq 1 ]
+ [ 4 -gt 0 ]
+ log_failure_msg adt-run exited with status 4.
+ log_msg Failure: adt-run exited with status 4.\n
+ date +%F %X
+ printf 2012-11-20 13:04:56: Failure: adt-run exited with status 4.\n
2012-11-20 13:04:56: Failure: adt-run exited with status 4.
+ [ 0 -eq 0 ]
+ mkdir -p <http://10.189.74.2:8080/job/raring-proposed-adt-ubuntu-drivers-common/./ARCH=amd64,label=albali/ws/results>
+ ssh -o UserKnownHostsFile=/dev/null -o StrictHostKeyChecking=no -o CheckHostIP=no -i /var/cache/adt/disks/adtkey -p 54326 -t -o BatchMode=yes -l ubuntu localhost sudo chown -R ubuntu /home/ubuntu/adt-log; find  -type f -empty | xargs rm
Pseudo-terminal will not be allocated because stdin is not a terminal.
Warning: Permanently added '[localhost]:54326' (ECDSA) to the list of known hosts.
sudo: unable to resolve host autopkgtest
find: `./.autopkgtest/gpg': Permission denied
+ scp -r -o UserKnownHostsFile=/dev/null -o StrictHostKeyChecking=no -o CheckHostIP=no -i /var/cache/adt/disks/adtkey -P 54326 ubuntu at localhost:/home/ubuntu/adt-log/*
    /var/crash/*crash /var/log/syslog <http://10.189.74.2:8080/job/raring-proposed-adt-ubuntu-drivers-common/./ARCH=amd64,label=albali/ws/results>
+ true
+ log_info_msg Test artifacts copied to <http://10.189.74.2:8080/job/raring-proposed-adt-ubuntu-drivers-common/./ARCH=amd64,label=albali/ws/results>
+ log_msg Info: Test artifacts copied to <http://10.189.74.2:8080/job/raring-proposed-adt-ubuntu-drivers-common/./ARCH=amd64,label=albali/ws/results\n>
+ date +%F %X
+ printf 2012-11-20 13:04:57: Info: Test artifacts copied to <http://10.189.74.2:8080/job/raring-proposed-adt-ubuntu-drivers-common/./ARCH=amd64,label=albali/ws/results\n>
2012-11-20 13:04:57: Info: Test artifacts copied to <http://10.189.74.2:8080/job/raring-proposed-adt-ubuntu-drivers-common/./ARCH=amd64,label=albali/ws/results>
+ [ -n 2012-11-20_12-01-57 ]
+ log_info_msg Updating Jenkins results
+ log_msg Info: Updating Jenkins results\n
+ date +%F %X
+ printf 2012-11-20 13:04:57: Info: Updating Jenkins results\n
2012-11-20 13:04:57: Info: Updating Jenkins results
+ res=fail
+ [ 4 -eq 0 ]
+ OPTS=-d
+ [ 1 -eq 1 ]
+ OPTS=-d -P
+ /var/lib/ubuntu-iso-testing/auto-package-testing/bin/../jenkins/update-adt-result -d -P -r raring ubuntu-drivers-common amd64 fail
2012-11-20 13:04:57,413 DEBUG Debug mode enabled
2012-11-20 13:04:57,413 DEBUG aptroot: /var/lib/ubuntu-iso-testing/auto-package-testing/aptroot/raring-proposed-amd64
2012-11-20 13:04:57,413 DEBUG Loading status from /var/lib/ubuntu-iso-testing/auto-package-testing/aptroot/raring-proposed-amd64/var/cache/adt/raring-proposed_amd64_ubuntu-drivers-common
2012-11-20 13:04:57,414 DEBUG Writing status file
2012-11-20 13:04:57,414 INFO Writing results to /var/lib/ubuntu-iso-testing/auto-package-testing/aptroot/raring-proposed-amd64/../raring/raring-proposed_ubuntu-drivers-common_20121120-130457
+ [ 0 -eq 0 ]
+ ssh -o UserKnownHostsFile=/dev/null -o StrictHostKeyChecking=no -o CheckHostIP=no -i /var/cache/adt/disks/adtkey -p 54326 -t -o BatchMode=yes -l ubuntu localhost sudo poweroff
Pseudo-terminal will not be allocated because stdin is not a terminal.
Warning: Permanently added '[localhost]:54326' (ECDSA) to the list of known hosts.
sudo: unable to resolve host autopkgtest
+ exit 4
+ on_exit
+ log_info_msg Cleaning up
+ log_msg Info: Cleaning up\n
+ date +%F %X
+ printf 2012-11-20 13:04:58: Info: Cleaning up\n
2012-11-20 13:04:58: Info: Cleaning up
+ [ -f /dev/shm/adt/raring-amd64-ubuntu-drivers-common-20121120_123523.img.pid ]
+ cat /dev/shm/adt/raring-amd64-ubuntu-drivers-common-20121120_123523.img.pid
+ kill -9 41888
+ rm -f /dev/shm/adt/raring-amd64-ubuntu-drivers-common-20121120_123523.img.pid
+ rm -f /dev/shm/adt/raring-amd64-ubuntu-drivers-common-20121120_123523.img
+ rm -f /var/lock/adt/ssh.54326.lock
+ rm -f /var/lock/adt/vnc.5914.lock
+ [ -d /tmp/adt-amd64.d9XcER ]
+ rm -Rf /tmp/adt-amd64.d9XcER
+ exit 4
Build step 'Execute shell' marked build as failure
Archiving artifacts



More information about the ubuntu-testing-notifications mailing list