Build failed in Jenkins: raring-adt-ubuntu-drivers-common » amd64,albali #6

Jenkins Notification devnull at canonical.com
Mon Nov 5 18:06:14 UTC 2012


See <http://10.189.74.2:8080/job/raring-adt-ubuntu-drivers-common/./ARCH=amd64,label=albali/6/>

------------------------------------------
[...truncated 596 lines...]
Get:2 http://archive.ubuntu.com/ubuntu/ raring/main libsamplerate0 amd64 0.1.8-5 [1,342 kB]
Get:3 http://archive.ubuntu.com/ubuntu/ raring/main python3-xkit all 0.5.0ubuntu1 [21.1 kB]
Get:4 http://archive.ubuntu.com/ubuntu/ raring/main alsa-utils amd64 1.0.25-3ubuntu2 [1,120 kB]
Get:5 http://archive.ubuntu.com/ubuntu/ raring/main ubuntu-drivers-common amd64 1:0.2.71ubuntu1 [34.0 kB]
Get:6 http://archive.ubuntu.com/ubuntu/ raring/main dh-modaliases all 1:0.2.71ubuntu1 [8,468 B]
Get:7 http://archive.ubuntu.com/ubuntu/ raring/universe nvidia-common amd64 1:0.2.71ubuntu1 [1,286 B]
Preconfiguring packages ...
Fetched 2,955 kB in 7s (400 kB/s)
Selecting previously unselected package libasound2:amd64.
(Reading database ... 63202 files and directories currently installed.)
Unpacking libasound2:amd64 (from .../libasound2_1.0.25-4ubuntu1_amd64.deb) ...
Selecting previously unselected package libsamplerate0:amd64.
Unpacking libsamplerate0:amd64 (from .../libsamplerate0_0.1.8-5_amd64.deb) ...
Selecting previously unselected package python3-xkit.
Unpacking python3-xkit (from .../python3-xkit_0.5.0ubuntu1_all.deb) ...
Selecting previously unselected package alsa-utils.
Unpacking alsa-utils (from .../alsa-utils_1.0.25-3ubuntu2_amd64.deb) ...
Selecting previously unselected package ubuntu-drivers-common.
Unpacking ubuntu-drivers-common (from .../ubuntu-drivers-common_1%3a0.2.71ubuntu1_amd64.deb) ...
Selecting previously unselected package dh-modaliases.
Unpacking dh-modaliases (from .../dh-modaliases_1%3a0.2.71ubuntu1_all.deb) ...
Selecting previously unselected package nvidia-common.
Unpacking nvidia-common (from .../nvidia-common_1%3a0.2.71ubuntu1_amd64.deb) ...
Processing triggers for man-db ...
Processing triggers for ureadahead ...
Setting up libasound2:amd64 (1.0.25-4ubuntu1) ...
Setting up libsamplerate0:amd64 (0.1.8-5) ...
Setting up python3-xkit (0.5.0ubuntu1) ...
Setting up alsa-utils (1.0.25-3ubuntu2) ...
Setting up dh-modaliases (1:0.2.71ubuntu1) ...
Processing triggers for ureadahead ...
Setting up ubuntu-drivers-common (1:0.2.71ubuntu1) ...
Processing triggers for ureadahead ...
Setting up nvidia-common (1:0.2.71ubuntu1) ...
Processing triggers for libc-bin ...
ldconfig deferred processing now taking place
 -> Finished parsing the build-deps
adt-run: trace: & dsc0t-system: [----------------------------------------
+ buildtree=/tmp/tmp.Fh6oyaa3HV/dsc0-build/ubuntu-drivers-common-0.2.71ubuntu1/
+ shift
+ rm -rf -- /tmp/tmp.Fh6oyaa3HV/dsc0t-system-testtmp /tmp/tmp.Fh6oyaa3HV/dsc0t-system-testtmp/tmpdir /tmp/tmp.Fh6oyaa3HV/dsc0t-system-testtmp/adttmp
+ mkdir -- /tmp/tmp.Fh6oyaa3HV/dsc0t-system-testtmp /tmp/tmp.Fh6oyaa3HV/dsc0t-system-testtmp/tmpdir /tmp/tmp.Fh6oyaa3HV/dsc0t-system-testtmp/adttmp
adt-run: trace: & dsc0t-system:  - - - - - - - - - - results - - - - - - - - - -
dsc0t-system         FAIL non-zero exit status 1
adt-run: trace: & dsc0t-system:  - - - - - - - - - - stdout - - - - - - - - - -
test_debug (__main__.TestSystem)
ubuntu-drivers debug succeeds ... ok
test_list (__main__.TestSystem)
ubuntu-drivers list succeeds ... ok
test_bcmwl (__main__.TestUbuntuDrivers)
bcmwl-kernel-source ... FAIL
test_fglrx (__main__.TestUbuntuDrivers)
fglrx ... 
--- Error output from package installation ---

Extracting templates from packages: 85%
Extracting templates from packages: 100%
update-alternatives: warning: forcing reinstallation of alternative /usr/lib/fglrx/ld.so.conf because link group x86_64-linux-gnu_gl_conf is broken
modprobe: ../tools/modprobe.c:550: print_action: Assertion `kmod_module_get_initstate(m) == KMOD_MODULE_BUILTIN' failed.
Aborted (core dumped)
WARNING: could not open /tmp/tmp.Fh6oyaa3HV/dsc0t-system-testtmp/tmpdir/mkinitramfs_d36k8P/lib/modules/3.5.0-17-generic/modules.builtin: No such file or directory

------
ok
test_fglrx_updates (__main__.TestUbuntuDrivers)
fglrx-updates ... 
--- Error output from package installation ---

Extracting templates from packages: 85%
Extracting templates from packages: 100%
update-alternatives: warning: forcing reinstallation of alternative /usr/lib/fglrx/ld.so.conf because link group x86_64-linux-gnu_gl_conf is broken
modprobe: ../tools/modprobe.c:550: print_action: Assertion `kmod_module_get_initstate(m) == KMOD_MODULE_BUILTIN' failed.
Aborted (core dumped)
WARNING: could not open /tmp/tmp.Fh6oyaa3HV/dsc0t-system-testtmp/tmpdir/mkinitramfs_LQ6DOF/lib/modules/3.5.0-17-generic/modules.builtin: No such file or directory

------
ok
test_nvidia_current (__main__.TestUbuntuDrivers)
nvidia-current ... 
--- Error output from package installation ---

Extracting templates from packages: 30%
Extracting templates from packages: 61%
Extracting templates from packages: 91%
Extracting templates from packages: 100%
adduser: Warning: The home directory `/var/lib/colord' does not belong to the user you are currently creating.
INFO:Enable nvidia-current
DEBUG:Parsing /usr/share/ubuntu-drivers-common/quirks/dell_latitude
DEBUG:Parsing /usr/share/ubuntu-drivers-common/quirks/put_your_quirks_here
DEBUG:Parsing /usr/share/ubuntu-drivers-common/quirks/lenovo_thinkpad
DEBUG:Processing quirk Latitude E6530
DEBUG:Failure to match Bochs with Dell Inc.
DEBUG:Quirk doesn't match
DEBUG:Processing quirk ThinkPad T420s
DEBUG:Failure to match Bochs with LENOVO
DEBUG:Quirk doesn't match
modprobe: ../tools/modprobe.c:550: print_action: Assertion `kmod_module_get_initstate(m) == KMOD_MODULE_BUILTIN' failed.
Aborted (core dumped)
WARNING: could not open /tmp/tmp.Fh6oyaa3HV/dsc0t-system-testtmp/tmpdir/mkinitramfs_VcFuSU/lib/modules/3.5.0-17-generic/modules.builtin: No such file or directory

------
ok
test_nvidia_current_updates (__main__.TestUbuntuDrivers)
nvidia-current-updates ... 
--- Error output from package installation ---

Extracting templates from packages: 53%
Extracting templates from packages: 100%
INFO:Enable nvidia-current-updates
DEBUG:Parsing /usr/share/ubuntu-drivers-common/quirks/dell_latitude
DEBUG:Parsing /usr/share/ubuntu-drivers-common/quirks/put_your_quirks_here
DEBUG:Parsing /usr/share/ubuntu-drivers-common/quirks/lenovo_thinkpad
DEBUG:Processing quirk Latitude E6530
DEBUG:Failure to match Bochs with Dell Inc.
DEBUG:Quirk doesn't match
DEBUG:Processing quirk ThinkPad T420s
DEBUG:Failure to match Bochs with LENOVO
DEBUG:Quirk doesn't match
update-alternatives: warning: alternative /usr/lib/nvidia-settings/ld.so.conf (part of link group nvidia_settings_conf) doesn't exist; removing from list of alternatives
update-alternatives: warning: /etc/alternatives/nvidia_settings_conf is dangling; it will be updated with best choice
modprobe: ../tools/modprobe.c:550: print_action: Assertion `kmod_module_get_initstate(m) == KMOD_MODULE_BUILTIN' failed.
Aborted (core dumped)
WARNING: could not open /tmp/tmp.Fh6oyaa3HV/dsc0t-system-testtmp/tmpdir/mkinitramfs_mr7UR7/lib/modules/3.5.0-17-generic/modules.builtin: No such file or directory

------
ok
test_sl_modem (__main__.TestUbuntuDrivers)
sl-modem-dkms ... ok
test_virtualbox (__main__.TestUbuntuDrivers)
virtualbox-dkms ... 
--- Error output from package installation ---

Extracting templates from packages: 63%
Extracting templates from packages: 100%
invoke-rc.d: initscript virtualbox, action "restart" failed.

------
ok

======================================================================
FAIL: test_bcmwl (__main__.TestUbuntuDrivers)
bcmwl-kernel-source
----------------------------------------------------------------------
Traceback (most recent call last):
  File "/tmp/tmp.Fh6oyaa3HV/dsc0-build/ubuntu-drivers-common-0.2.71ubuntu1/debian/tests/system", line 80, in test_bcmwl
    'bcmwl-kernel-source', 'wl', auto_install=True)
  File "/tmp/tmp.Fh6oyaa3HV/dsc0-build/ubuntu-drivers-common-0.2.71ubuntu1/debian/tests/system", line 129, in do_test_driver
    o = program_out_success(['ubuntu-drivers', 'autoinstall'], self)
  File "/tmp/tmp.Fh6oyaa3HV/dsc0-build/ubuntu-drivers-common-0.2.71ubuntu1/debian/tests/system", line 25, in program_out_success
    self.assertEqual(err, '', err)
AssertionError: 'Error: Module b43 is not currently loaded\nError: Module b43legacy is not curre [truncated]... != ''
- Error: Module b43 is not currently loaded
- Error: Module b43legacy is not currently loaded
- Error: Module ssb is not currently loaded
- Error: Module bcm43xx is not currently loaded
- Error: Module brcm80211 is not currently loaded
- Error: Module brcmfmac is not currently loaded
- Error: Module brcmsmac is not currently loaded
- Error: Module bcma is not currently loaded
- WARNING: could not open /tmp/tmp.Fh6oyaa3HV/dsc0t-system-testtmp/tmpdir/mkinitramfs_JYVxSn/lib/modules/3.5.0-17-generic/modules.builtin: No such file or directory
 : Error: Module b43 is not currently loaded
Error: Module b43legacy is not currently loaded
Error: Module ssb is not currently loaded
Error: Module bcm43xx is not currently loaded
Error: Module brcm80211 is not currently loaded
Error: Module brcmfmac is not currently loaded
Error: Module brcmsmac is not currently loaded
Error: Module bcma is not currently loaded
WARNING: could not open /tmp/tmp.Fh6oyaa3HV/dsc0t-system-testtmp/tmpdir/mkinitramfs_JYVxSn/lib/modules/3.5.0-17-generic/modules.builtin: No such file or directory


----------------------------------------------------------------------
Ran 9 tests in 1369.180s

FAILED (failures=1)
adt-run: trace: & dsc0t-system: ----------------------------------------]
adt-run: trace1: ** needs_reset, previously=False
adt-run: trace: @@@@@@@@@@@@@@@@@@@@@@@@@@@@@@@@@@@@@@@@ tests done.
adt-run: trace: ** stop
adt-run: trace: ** close, scratch=tb-scratch~/tmp/tmp.Fh6oyaa3HV:-/|/tmp/tmp.Fh6oyaa3HV/!
+ RC=4
+ [ 0 -eq 1 ]
+ chown -R ubuntu /home/ubuntu/adt-log
+ chmod og+r /var/log/syslog
+ chmod og+r /var/crash/_bin_kmod.0.crash
+ exit 4
+ RET=4
+ [ 0 -eq 1 ]
+ [ 4 -gt 0 ]
+ log_failure_msg adt-run exited with status 4.
+ log_msg Failure: adt-run exited with status 4.\n
+ date +%F %X
+ printf 2012-11-05 18:06:12: Failure: adt-run exited with status 4.\n
2012-11-05 18:06:12: Failure: adt-run exited with status 4.
+ [ 0 -eq 0 ]
+ mkdir -p <http://10.189.74.2:8080/job/raring-adt-ubuntu-drivers-common/./ARCH=amd64,label=albali/ws/results>
+ ssh -o UserKnownHostsFile=/dev/null -o StrictHostKeyChecking=no -o CheckHostIP=no -i /var/cache/adt/disks/adtkey -p 54323 -t -o BatchMode=yes -l ubuntu localhost sudo chown -R ubuntu /home/ubuntu/adt-log; find  -type f -empty | xargs rm
Pseudo-terminal will not be allocated because stdin is not a terminal.
Warning: Permanently added '[localhost]:54323' (ECDSA) to the list of known hosts.
sudo: unable to resolve host autopkgtest
find: `./.autopkgtest/gpg': Permission denied
+ scp -r -o UserKnownHostsFile=/dev/null -o StrictHostKeyChecking=no -o CheckHostIP=no -i /var/cache/adt/disks/adtkey -P 54323 ubuntu at localhost:/home/ubuntu/adt-log/*
    /var/crash/*crash /var/log/syslog <http://10.189.74.2:8080/job/raring-adt-ubuntu-drivers-common/./ARCH=amd64,label=albali/ws/results>
+ true
+ log_info_msg Test artifacts copied to <http://10.189.74.2:8080/job/raring-adt-ubuntu-drivers-common/./ARCH=amd64,label=albali/ws/results>
+ log_msg Info: Test artifacts copied to <http://10.189.74.2:8080/job/raring-adt-ubuntu-drivers-common/./ARCH=amd64,label=albali/ws/results\n>
+ date +%F %X
+ printf 2012-11-05 18:06:13: Info: Test artifacts copied to <http://10.189.74.2:8080/job/raring-adt-ubuntu-drivers-common/./ARCH=amd64,label=albali/ws/results\n>
2012-11-05 18:06:13: Info: Test artifacts copied to <http://10.189.74.2:8080/job/raring-adt-ubuntu-drivers-common/./ARCH=amd64,label=albali/ws/results>
+ [ -n 2012-11-05_17-41-16 ]
+ log_info_msg Updating Jenkins results
+ log_msg Info: Updating Jenkins results\n
+ date +%F %X
+ printf 2012-11-05 18:06:13: Info: Updating Jenkins results\n
2012-11-05 18:06:13: Info: Updating Jenkins results
+ res=fail
+ [ 4 -eq 0 ]
+ OPTS=-d
+ [ 0 -eq 1 ]
+ /var/lib/ubuntu-iso-testing/auto-package-testing/bin/../jenkins/update-adt-result -d -r raring ubuntu-drivers-common amd64 fail
2012-11-05 18:06:13,422 DEBUG Debug mode enabled
2012-11-05 18:06:13,422 DEBUG aptroot: /var/lib/ubuntu-iso-testing/auto-package-testing/aptroot/raring-amd64
2012-11-05 18:06:13,422 DEBUG Loading status from /var/lib/ubuntu-iso-testing/auto-package-testing/aptroot/raring-amd64/var/cache/adt/raring_amd64_ubuntu-drivers-common
2012-11-05 18:06:13,422 DEBUG Writing status file
2012-11-05 18:06:13,423 INFO Writing results to /var/lib/ubuntu-iso-testing/auto-package-testing/aptroot/raring-amd64/../raring/raring_ubuntu-drivers-common_20121105-180613
+ [ 0 -eq 0 ]
+ ssh -o UserKnownHostsFile=/dev/null -o StrictHostKeyChecking=no -o CheckHostIP=no -i /var/cache/adt/disks/adtkey -p 54323 -t -o BatchMode=yes -l ubuntu localhost sudo poweroff
Pseudo-terminal will not be allocated because stdin is not a terminal.
Warning: Permanently added '[localhost]:54323' (ECDSA) to the list of known hosts.
sudo: unable to resolve host autopkgtest
+ exit 4
+ on_exit
+ log_info_msg Cleaning up
+ log_msg Info: Cleaning up\n
+ date +%F %X
+ printf 2012-11-05 18:06:14: Info: Cleaning up\n
2012-11-05 18:06:14: Info: Cleaning up
+ [ -f /dev/shm/adt/raring-amd64-ubuntu-drivers-common-20121105_174117.img.pid ]
+ cat /dev/shm/adt/raring-amd64-ubuntu-drivers-common-20121105_174117.img.pid
+ kill -9 46277
+ rm -f /dev/shm/adt/raring-amd64-ubuntu-drivers-common-20121105_174117.img.pid
+ rm -f /dev/shm/adt/raring-amd64-ubuntu-drivers-common-20121105_174117.img
+ rm -f /var/lock/adt/ssh.54323.lock
+ rm -f /var/lock/adt/vnc.5911.lock
+ [ -d /tmp/adt-amd64.vn5eTQ ]
+ rm -Rf /tmp/adt-amd64.vn5eTQ
+ exit 4
Build step 'Execute shell' marked build as failure
Archiving artifacts



More information about the ubuntu-testing-notifications mailing list