Build failed in Jenkins: raring-adt-software-center » i386,albali #9

Jenkins Notification devnull at canonical.com
Mon Nov 5 16:18:33 UTC 2012


See <http://10.189.74.2:8080/job/raring-adt-software-center/./ARCH=i386,label=albali/9/>

------------------------------------------
[...truncated 2316 lines...]
test_get_subcategories (tests.test_dataprovider.DataProviderTestCase) ... ok
test_have_data_in_db (tests.test_dataprovider.DataProviderTestCase) ... ok
test_dbus_on_real_bus (tests.test_dataprovider.DbusForRealTestCase) ... ok
test_idle_timeout (tests.test_dataprovider.IdleTimeoutTestCase) ... ok
test_idle_timeout_updates (tests.test_dataprovider.IdleTimeoutTestCase) ... Traceback (most recent call last):
  File "/tmp/tmp.qslCUvXk4G/dsc0-build/software-center-5.5.0/data/update-software-center-agent", line 112, in <module>
    if not update_from_software_center_agent(db, cache, options.ignore_cache, include_sca_qa):
  File "./softwarecenter/db/update.py", line 1061, in update_from_software_center_agent
    token = helper.find_oauth_token_sync()
  File "./softwarecenter/backend/ubuntusso.py", line 138, in find_oauth_token_sync
    sso = self. _get_login_backend_and_connect()
  File "./softwarecenter/backend/ubuntusso.py", line 130, in _get_login_backend_and_connect
    _(SOFTWARE_CENTER_SSO_DESCRIPTION))
  File "./softwarecenter/backend/login.py", line 80, in get_login_backend
    sso_class = LoginBackendDbusSSO(window_id, appname, help_text)
  File "./softwarecenter/backend/login_impl/login_sso.py", line 46, in __init__
    self.bus = dbus.SessionBus()
  File "/usr/lib/python2.7/dist-packages/dbus/_dbus.py", line 211, in __new__
    mainloop=mainloop)
  File "/usr/lib/python2.7/dist-packages/dbus/_dbus.py", line 100, in __new__
    bus = BusConnection.__new__(subclass, bus_type, mainloop=mainloop)
  File "/usr/lib/python2.7/dist-packages/dbus/bus.py", line 122, in __new__
    bus = cls._new_for_bus(address_or_type, mainloop=mainloop)
dbus.exceptions.DBusException: org.freedesktop.DBus.Error.NoServer: Failed to connect to socket /tmp/dbus-XYTnVNbDuB: Connection refused
ok
test_empty_dict_set (tests.test_dataprovider.PropertyDictExceptionsTestCase) ... ok
test_normal_dict (tests.test_dataprovider.PropertyDictExceptionsTestCase) ... ok
test_normal_set (tests.test_dataprovider.PropertyDictExceptionsTestCase) ... ok
test_simple (tests.test_dataprovider.PropertyDictExceptionsTestCase) ... ok

======================================================================
FAIL: test_get_details (tests.test_dataprovider.DataProviderTestCase)
----------------------------------------------------------------------
Traceback (most recent call last):
  File "tests/test_dataprovider.py", line 136, in test_get_details
    self.assertEqual(result["is_desktop_dependency"], True)
AssertionError: False != True

----------------------------------------------------------------------
Ran 15 tests in 10.631s

FAILED (failures=1)
Traceback (most recent call last):
  File "/tmp/tmp.qslCUvXk4G/dsc0-build/software-center-5.5.0/data/update-software-center-agent", line 112, in <module>
    if not update_from_software_center_agent(db, cache, options.ignore_cache, include_sca_qa):
  File "./softwarecenter/db/update.py", line 1061, in update_from_software_center_agent
    token = helper.find_oauth_token_sync()
  File "./softwarecenter/backend/ubuntusso.py", line 138, in find_oauth_token_sync
    sso = self. _get_login_backend_and_connect()
  File "./softwarecenter/backend/ubuntusso.py", line 130, in _get_login_backend_and_connect
    _(SOFTWARE_CENTER_SSO_DESCRIPTION))
  File "./softwarecenter/backend/login.py", line 80, in get_login_backend
    sso_class = LoginBackendDbusSSO(window_id, appname, help_text)
  File "./softwarecenter/backend/login_impl/login_sso.py", line 46, in __init__
    self.bus = dbus.SessionBus()
  File "/usr/lib/python2.7/dist-packages/dbus/_dbus.py", line 211, in __new__
    mainloop=mainloop)
  File "/usr/lib/python2.7/dist-packages/dbus/_dbus.py", line 100, in __new__
    bus = BusConnection.__new__(subclass, bus_type, mainloop=mainloop)
  File "/usr/lib/python2.7/dist-packages/dbus/bus.py", line 122, in __new__
    bus = cls._new_for_bus(address_or_type, mainloop=mainloop)
dbus.exceptions.DBusException: org.freedesktop.DBus.Error.NoServer: Failed to connect to socket /tmp/dbus-XYTnVNbDuB: Connection refused
Traceback (most recent call last):
  File "/usr/lib/python2.7/runpy.py", line 162, in _run_module_as_main
    "__main__", fname, loader, pkg_name)
  File "/usr/lib/python2.7/runpy.py", line 72, in _run_code
    exec code in run_globals
  File "/usr/lib/python2.7/unittest/__main__.py", line 12, in <module>
    main(module=None)
  File "/usr/lib/python2.7/unittest/main.py", line 94, in __init__
    self.parseArgs(argv)
  File "/usr/lib/python2.7/unittest/main.py", line 149, in parseArgs
    self.createTests()
  File "/usr/lib/python2.7/unittest/main.py", line 158, in createTests
    self.module)
  File "/usr/lib/python2.7/unittest/loader.py", line 128, in loadTestsFromNames
    suites = [self.loadTestsFromName(name, module) for name in names]
  File "/usr/lib/python2.7/unittest/loader.py", line 91, in loadTestsFromName
    module = __import__('.'.join(parts_copy))
  File "tests/test_origin.py", line 13, in <module>
    class TestOrigins(unittest.TestCase):
  File "tests/test_origin.py", line 17, in TestOrigins
    url_accessable("http://de.archive.ubuntu.com/ubuntu", "dists/"),
  File "tests/utils.py", line 64, in url_accessable
    f = urlopen(url)
  File "/usr/lib/python2.7/urllib2.py", line 127, in urlopen
    return _opener.open(url, data, timeout)
  File "/usr/lib/python2.7/urllib2.py", line 401, in open
    response = self._open(req, data)
  File "/usr/lib/python2.7/urllib2.py", line 419, in _open
    '_open', req)
  File "/usr/lib/python2.7/urllib2.py", line 379, in _call_chain
    result = func(*args)
  File "/usr/lib/python2.7/urllib2.py", line 1211, in http_open
    return self.do_open(httplib.HTTPConnection, req)
  File "/usr/lib/python2.7/urllib2.py", line 1181, in do_open
    raise URLError(err)
urllib2.URLError: <urlopen error [Errno 111] Connection refused>
ERROR:root:Could not find any typelib for Gst
WARNING:root:failed to init network state watcher 'org.freedesktop.DBus.Error.ServiceUnknown: The name org.freedesktop.NetworkManager was not provided by any .service files'
WARNING:softwarecenter.fixme:logs to the root logger: '('softwarecenter/netstatus.py', 122, '__init_network_state')'
2012-11-05 16:10:37,176 - softwarecenter.fixme - WARNING - logs to the root logger: '('softwarecenter/netstatus.py', 122, '__init_network_state')'
2012-11-05 16:10:37,176 - root - WARNING - failed to init network state watcher 'org.freedesktop.DBus.Error.ServiceUnknown: The name org.freedesktop.NetworkManager was not provided by any .service files'
test_hardware_requirements_box (tests.gtk3.test_widgets.TestHWRequirements) ... INFO:root:Attempting one time ping of archive.ubuntu.com to test if internet connectivity exists.
WARNING:softwarecenter.fixme:logs to the root logger: '('softwarecenter/netstatus.py', 151, 'test_ping')'
2012-11-05 16:10:37,217 - softwarecenter.fixme - WARNING - logs to the root logger: '('softwarecenter/netstatus.py', 151, 'test_ping')'
2012-11-05 16:10:37,215 - root - INFO - Attempting one time ping of archive.ubuntu.com to test if internet connectivity exists.
ok
test_hardware_requirements_label (tests.gtk3.test_widgets.TestHWRequirements) ... ok
test_hardware_requirements_label_utf8 (tests.gtk3.test_widgets.TestHWRequirements) ... ok
test_reviews_includes_any_language (tests.gtk3.test_widgets.TestUIReviewsList) ... ok
test_reviews_no_reviews_but_app_not_installed (tests.gtk3.test_widgets.TestUIReviewsList) ... ok
test_reviews_no_reviews_offer_to_write_one (tests.gtk3.test_widgets.TestUIReviewsList) ... ok
test_reviews_offers_to_relax_language (tests.gtk3.test_widgets.TestUIReviewsList) ... ok
test_actionbar (tests.gtk3.test_widgets.TestWidgets) ... ok
test_apptreeview (tests.gtk3.test_widgets.TestWidgets) ... INFO:softwarecenter.db.pkginfo_impl.aptcache:aptcache.open()
2012-11-05 16:10:37,538 - softwarecenter.db.pkginfo_impl.aptcache - INFO - aptcache.open()
INFO:softwarecenter.db.pkginfo_impl.aptcache:aptcache.open()
2012-11-05 16:10:37,738 - softwarecenter.db.pkginfo_impl.aptcache - INFO - aptcache.open()
INFO:softwarecenter.db.database:open() database: path=None use_axi=True use_agent=True
2012-11-05 16:10:37,935 - softwarecenter.db.database - INFO - open() database: path=None use_axi=True use_agent=True
WARNING:softwarecenter.region:failed to use geoclue: 'org.freedesktop.DBus.Error.ServiceUnknown: The name org.freedesktop.Geoclue.Master was not provided by any .service files'
2012-11-05 16:10:37,942 - softwarecenter.region - WARNING - failed to use geoclue: 'org.freedesktop.DBus.Error.ServiceUnknown: The name org.freedesktop.Geoclue.Master was not provided by any .service files'
ok
test_backforward (tests.gtk3.test_widgets.TestWidgets) ... ok
test_backforward_lp1034894 (tests.gtk3.test_widgets.TestWidgets) ... ok
test_buttons (tests.gtk3.test_widgets.TestWidgets) ... ok
test_containers (tests.gtk3.test_widgets.TestWidgets) ... ok
test_description (tests.gtk3.test_widgets.TestWidgets) ... ok
test_exhibits (tests.gtk3.test_widgets.TestWidgets) ... ok
test_screenshot_thumbnail (tests.gtk3.test_widgets.TestWidgets) ... INFO:softwarecenter.db.pkginfo_impl.aptcache:aptcache.open()
2012-11-05 16:10:40,387 - softwarecenter.db.pkginfo_impl.aptcache - INFO - aptcache.open()
INFO:softwarecenter.db.database:open() database: path=None use_axi=True use_agent=True
2012-11-05 16:10:40,627 - softwarecenter.db.database - INFO - open() database: path=None use_axi=True use_agent=True
WARNING:softwarecenter.simplefiledownloader:url changed from 'http://screenshots.ubuntu.com/screenshot-with-version/totem/3.4.3-0ubuntu4' to 'http://screenshots.ubuntu.com/screenshot-with-version/comix/4.0.4-1'
2012-11-05 16:10:40,632 - softwarecenter.simplefiledownloader - WARNING - url changed from 'http://screenshots.ubuntu.com/screenshot-with-version/totem/3.4.3-0ubuntu4' to 'http://screenshots.ubuntu.com/screenshot-with-version/comix/4.0.4-1'
FAIL
test_searchentry (tests.gtk3.test_widgets.TestWidgets) ... ok
test_show_image_dialog (tests.gtk3.test_widgets.TestWidgets) ... ok
test_spinner (tests.gtk3.test_widgets.TestWidgets) ... ok
test_stars (tests.gtk3.test_widgets.TestWidgets) ... ok
test_symbolic_icons (tests.gtk3.test_widgets.TestWidgets) ... ok
test_videoplayer (tests.gtk3.test_widgets.TestWidgets) ... ok
test_stop (tests.gtk3.test_widgets.VideoPlayerTestCase) ... ok
test_uri (tests.gtk3.test_widgets.VideoPlayerTestCase) ... ok

======================================================================
FAIL: test_screenshot_thumbnail (tests.gtk3.test_widgets.TestWidgets)
----------------------------------------------------------------------
Traceback (most recent call last):
  File "tests/gtk3/test_widgets.py", line 129, in test_screenshot_thumbnail
    t.spinner.get_property("visible"))
AssertionError: False is not true

----------------------------------------------------------------------
Ran 24 tests in 4.053s

FAILED (failures=1)
INFO:root:ping output: 'Internet connection available!
PING archive.ubuntu.com (91.189.92.177) 56(84) bytes of data.

--- archive.ubuntu.com ping statistics ---
1 packets transmitted, 0 received, 100% packet loss, time 0ms

'
WARNING:softwarecenter.fixme:logs to the root logger: '('softwarecenter/netstatus.py', 168, 'test_ping')'
2012-11-05 16:10:47,226 - softwarecenter.fixme - WARNING - logs to the root logger: '('softwarecenter/netstatus.py', 168, 'test_ping')'
2012-11-05 16:10:47,226 - root - INFO - ping output: 'Internet connection available!
PING archive.ubuntu.com (91.189.92.177) 56(84) bytes of data.

--- archive.ubuntu.com ping statistics ---
1 packets transmitted, 0 received, 100% packet loss, time 0ms

'
+ exit 1
adt-run: trace: & dsc0t-run-tests: ----------------------------------------]
adt-run: trace1: ** needs_reset, previously=False
adt-run: trace: @@@@@@@@@@@@@@@@@@@@@@@@@@@@@@@@@@@@@@@@ tests done.
adt-run: trace: ** stop
adt-run: trace: ** close, scratch=tb-scratch~/tmp/tmp.qslCUvXk4G:-/|/tmp/tmp.qslCUvXk4G/!
+ RC=4
+ [ 0 -eq 1 ]
+ chown -R ubuntu /home/ubuntu/adt-log
+ chmod og+r /var/log/syslog
+ chmod og+r /var/crash/_usr_lib_python3.3_unittest___init__.py.1000.crash
+ exit 4
+ RET=4
+ [ 0 -eq 1 ]
+ [ 4 -gt 0 ]
+ log_failure_msg adt-run exited with status 4.
+ log_msg Failure: adt-run exited with status 4.\n
+ date +%F %X
+ printf 2012-11-05 16:18:26: Failure: adt-run exited with status 4.\n
2012-11-05 16:18:26: Failure: adt-run exited with status 4.
+ [ 0 -eq 0 ]
+ mkdir -p <http://10.189.74.2:8080/job/raring-adt-software-center/./ARCH=i386,label=albali/ws/results>
+ ssh -o UserKnownHostsFile=/dev/null -o StrictHostKeyChecking=no -o CheckHostIP=no -i /var/cache/adt/disks/adtkey -p 54329 -t -o BatchMode=yes -l ubuntu localhost sudo chown -R ubuntu /home/ubuntu/adt-log; find  -type f -empty | xargs rm
Pseudo-terminal will not be allocated because stdin is not a terminal.
Warning: Permanently added '[localhost]:54329' (ECDSA) to the list of known hosts.
sudo: unable to resolve host autopkgtest
find: `./.autopkgtest/gpg': Permission denied
+ scp -r -o UserKnownHostsFile=/dev/null -o StrictHostKeyChecking=no -o CheckHostIP=no -i /var/cache/adt/disks/adtkey -P 54329 ubuntu at localhost:/home/ubuntu/adt-log/*
    /var/crash/*crash /var/log/syslog <http://10.189.74.2:8080/job/raring-adt-software-center/./ARCH=i386,label=albali/ws/results>
+ true
+ log_info_msg Test artifacts copied to <http://10.189.74.2:8080/job/raring-adt-software-center/./ARCH=i386,label=albali/ws/results>
+ log_msg Info: Test artifacts copied to <http://10.189.74.2:8080/job/raring-adt-software-center/./ARCH=i386,label=albali/ws/results\n>
+ date +%F %X
+ printf 2012-11-05 16:18:32: Info: Test artifacts copied to <http://10.189.74.2:8080/job/raring-adt-software-center/./ARCH=i386,label=albali/ws/results\n>
2012-11-05 16:18:32: Info: Test artifacts copied to <http://10.189.74.2:8080/job/raring-adt-software-center/./ARCH=i386,label=albali/ws/results>
+ [ -n 2012-11-05_15-51-19 ]
+ log_info_msg Updating Jenkins results
+ log_msg Info: Updating Jenkins results\n
+ date +%F %X
+ printf 2012-11-05 16:18:32: Info: Updating Jenkins results\n
2012-11-05 16:18:32: Info: Updating Jenkins results
+ res=fail
+ [ 4 -eq 0 ]
+ OPTS=-d
+ [ 0 -eq 1 ]
+ /var/lib/ubuntu-iso-testing/auto-package-testing/bin/../jenkins/update-adt-result -d -r raring software-center i386 fail
2012-11-05 16:18:32,552 DEBUG Debug mode enabled
2012-11-05 16:18:32,552 DEBUG aptroot: /var/lib/ubuntu-iso-testing/auto-package-testing/aptroot/raring-amd64
2012-11-05 16:18:32,553 DEBUG Loading status from /var/lib/ubuntu-iso-testing/auto-package-testing/aptroot/raring-amd64/var/cache/adt/raring_amd64_software-center
2012-11-05 16:18:32,553 DEBUG Writing status file
2012-11-05 16:18:32,554 INFO Writing results to /var/lib/ubuntu-iso-testing/auto-package-testing/aptroot/raring-amd64/../raring/raring_software-center_20121105-161832
+ [ 0 -eq 0 ]
+ ssh -o UserKnownHostsFile=/dev/null -o StrictHostKeyChecking=no -o CheckHostIP=no -i /var/cache/adt/disks/adtkey -p 54329 -t -o BatchMode=yes -l ubuntu localhost sudo poweroff
Pseudo-terminal will not be allocated because stdin is not a terminal.
Warning: Permanently added '[localhost]:54329' (ECDSA) to the list of known hosts.
sudo: unable to resolve host autopkgtest
+ exit 4
+ on_exit
+ log_info_msg Cleaning up
+ log_msg Info: Cleaning up\n
+ date +%F %X
+ printf 2012-11-05 16:18:32: Info: Cleaning up\n
2012-11-05 16:18:32: Info: Cleaning up
+ [ -f /dev/shm/adt/raring-i386-software-center-20121105_155119.img.pid ]
+ cat /dev/shm/adt/raring-i386-software-center-20121105_155119.img.pid
+ kill -9 36366
+ rm -f /dev/shm/adt/raring-i386-software-center-20121105_155119.img.pid
+ rm -f /dev/shm/adt/raring-i386-software-center-20121105_155119.img
+ rm -f /var/lock/adt/ssh.54329.lock
+ rm -f /var/lock/adt/vnc.5917.lock
+ [ -d /tmp/adt-i386.KcvCZu ]
+ rm -Rf /tmp/adt-i386.KcvCZu
+ exit 4
Build step 'Execute shell' marked build as failure
Archiving artifacts



More information about the ubuntu-testing-notifications mailing list