Build failed in Jenkins: raring-adt-ubuntu-release-upgrader » i386,albali #6

Jenkins Notification devnull at canonical.com
Mon Nov 5 11:27:34 UTC 2012


See <http://10.189.74.2:8080/job/raring-adt-ubuntu-release-upgrader/./ARCH=i386,label=albali/6/>

------------------------------------------
[...truncated 1955 lines...]
Setting up libxss1:i386 (1:1.2.2-1) ...
Setting up gir1.2-gtk-3.0 (3.6.0-0ubuntu3) ...
Setting up libvte-2.90-9 (1:0.34.0-0ubuntu1) ...
Setting up gir1.2-vte-2.90 (1:0.34.0-0ubuntu1) ...
Setting up libindicator3-7 (12.10.1-0ubuntu1) ...
Setting up libappindicator3-1 (12.10.0-0ubuntu1) ...
Setting up notification-daemon (0.7.6-1) ...
Setting up python3-aptdaemon.gtk3widgets (0.45+bzr861-0ubuntu9.2) ...
Setting up libice6:i386 (2:1.0.8-2) ...
Setting up libsm6:i386 (2:1.2.1-2) ...
Setting up libxt6:i386 (1:1.1.3-1) ...
Setting up libaudio2:i386 (1.9.3-5) ...
Setting up libxmu6:i386 (2:1.1.1-1) ...
Setting up libxaw7:i386 (2:1.0.10-2) ...
Setting up x11-xkb-utils (7.7~1) ...
Setting up xserver-common (2:1.13.0-0ubuntu6) ...
Setting up xvfb (2:1.13.0-0ubuntu6) ...
Processing triggers for dictionaries-common ...
aspell-autobuildhash: processing: en [en-common]
aspell-autobuildhash: processing: en [en-variant_0]
aspell-autobuildhash: processing: en [en-variant_1]
aspell-autobuildhash: processing: en [en-variant_2]
aspell-autobuildhash: processing: en [en-w_accents-only]
aspell-autobuildhash: processing: en [en-wo_accents-only]
aspell-autobuildhash: processing: en [en_CA-variant_0]
aspell-autobuildhash: processing: en [en_CA-variant_1]
aspell-autobuildhash: processing: en [en_CA-w_accents-only]
aspell-autobuildhash: processing: en [en_CA-wo_accents-only]
aspell-autobuildhash: processing: en [en_GB-ise-w_accents-only]
aspell-autobuildhash: processing: en [en_GB-ise-wo_accents-only]
aspell-autobuildhash: processing: en [en_GB-ize-w_accents-only]
aspell-autobuildhash: processing: en [en_GB-ize-wo_accents-only]
aspell-autobuildhash: processing: en [en_GB-variant_0]
aspell-autobuildhash: processing: en [en_GB-variant_1]
aspell-autobuildhash: processing: en [en_US-w_accents-only]
aspell-autobuildhash: processing: en [en_US-wo_accents-only]
Setting up aspell (0.60.7~20110707-1build1) ...
Processing triggers for dictionaries-common ...
Setting up aspell-en (7.1-0-1) ...
Processing triggers for dictionaries-common ...
Setting up libenchant1c2a (1.6.0-7build1) ...
Setting up libwebkitgtk-3.0-0 (1.10.0-0ubuntu1) ...
Setting up gir1.2-webkit-3.0 (1.10.0-0ubuntu1) ...
Setting up libqtgui4:i386 (4:4.8.3+dfsg-0ubuntu3) ...
Setting up libdbusmenu-qt2:i386 (0.9.2-0ubuntu3) ...
Setting up libphonon4:i386 (4:4.7.0really4.6.0-0ubuntu2) ...
Setting up libprison0:i386 (1.0+dfsg-1) ...
Setting up libqt4-designer:i386 (4:4.8.3+dfsg-0ubuntu3) ...
Setting up libqt4-help:i386 (4:4.8.3+dfsg-0ubuntu3) ...
Setting up libqt4-opengl:i386 (4:4.8.3+dfsg-0ubuntu3) ...
Setting up libqt4-qt3support:i386 (4:4.8.3+dfsg-0ubuntu3) ...
Setting up libqt4-scripttools:i386 (4:4.8.3+dfsg-0ubuntu3) ...
Setting up libqt4-svg:i386 (4:4.8.3+dfsg-0ubuntu3) ...
Setting up libqtwebkit4:i386 (2.2.1-4ubuntu1) ...
Setting up odbcinst (2.2.14p2-5ubuntu4) ...
Setting up odbcinst1debian2:i386 (2.2.14p2-5ubuntu4) ...
Setting up phonon-backend-gstreamer:i386 (4:4.7.0really4.6.2-0ubuntu1) ...
Setting up libkdeui5 (4:4.9.2-0ubuntu3) ...
Setting up libvirtodbc0 (6.1.6+repack-0ubuntu1) ...
Setting up soprano-daemon (2.8.0+dfsg.1-0ubuntu1) ...
Setting up libsoprano4 (2.8.0+dfsg.1-0ubuntu1) ...
Setting up libnepomuk4 (4:4.9.2-0ubuntu3) ...
Setting up libsolid4 (4:4.9.2-0ubuntu3) ...
Setting up libkio5 (4:4.9.2-0ubuntu3) ...
Setting up libnepomukquery4a (4:4.9.2-0ubuntu3) ...
Setting up libkcmutils4 (4:4.9.2-0ubuntu3) ...
Setting up libnepomukutils4 (4:4.9.2-0ubuntu3) ...
Setting up libkparts4 (4:4.9.2-0ubuntu3) ...
Setting up libkdewebkit5 (4:4.9.2-0ubuntu3) ...
Setting up libkdnssd4 (4:4.9.2-0ubuntu3) ...
Setting up libknewstuff3-4 (4:4.9.2-0ubuntu3) ...
Setting up libkemoticons4 (4:4.9.2-0ubuntu3) ...
Setting up libkfile4 (4:4.9.2-0ubuntu3) ...
Setting up libktexteditor4 (4:4.9.2-0ubuntu3) ...
Setting up libkhtml5 (4:4.9.2-0ubuntu3) ...
Setting up libkmediaplayer4 (4:4.9.2-0ubuntu3) ...
Setting up libknotifyconfig4 (4:4.9.2-0ubuntu3) ...
Setting up libkxmlrpcclient4 (4:4.9.2-0ubuntu1) ...
Setting up libnepomukcore4abi1 (4:4.9.2-0ubuntu2) ...
Setting up ntrack-module-libnl-0 (016-1.1) ...
Setting up libntrack0 (016-1.1) ...
Setting up libntrack-qt4-1 (016-1.1) ...
Setting up phonon:i386 (4:4.7.0really4.6.0-0ubuntu2) ...
Setting up libkde3support4 (4:4.9.2-0ubuntu3) ...
Setting up libkjsembed4 (4:4.9.2-0ubuntu3) ...
Setting up libkrosscore4 (4:4.9.2-0ubuntu3) ...
Setting up libpolkit-qt-1-1 (0.103.0-1build1) ...
Setting up kdelibs-bin (4:4.9.2-0ubuntu3) ...
Setting up libkatepartinterfaces4 (4:4.9.2-0ubuntu1) ...
Setting up katepart (4:4.9.2-0ubuntu1) ...
Setting up libkidletime4 (4:4.9.2-0ubuntu3) ...
Setting up libnepomuksync4 (4:4.9.2-0ubuntu2) ...
Setting up nepomuk-core (4:4.9.2-0ubuntu2) ...
Setting up libkldap4 (4:4.9.2-0ubuntu1) ...
Setting up kdepimlibs-kio-plugins (4:4.9.2-0ubuntu1) ...
Setting up libakonadi-kde4 (4:4.9.2-0ubuntu1) ...
Setting up libkcalcore4 (4:4.9.2-0ubuntu1) ...
Setting up libakonadi-calendar4 (4:4.9.2-0ubuntu1) ...
Setting up libkresources4 (4:4.9.2-0ubuntu1) ...
Setting up libkabc4 (4:4.9.2-0ubuntu1) ...
Setting up libkpimutils4 (4:4.9.2-0ubuntu1) ...
Setting up libakonadi-contact4 (4:4.9.2-0ubuntu1) ...
Setting up libkcal4 (4:4.9.2-0ubuntu1) ...
Setting up libakonadi-kcal4 (4:4.9.2-0ubuntu1) ...
Setting up libakonadi-kmime4 (4:4.9.2-0ubuntu1) ...
Setting up libakonadi-notes4 (4:4.9.2-0ubuntu1) ...
Setting up libkholidays4 (4:4.9.2-0ubuntu1) ...
Setting up libkpimtextedit4 (4:4.9.2-0ubuntu1) ...
Setting up libkpimidentities4 (4:4.9.2-0ubuntu1) ...
Setting up libkalarmcal2 (4:4.9.2-0ubuntu1) ...
Setting up libkcalutils4 (4:4.9.2-0ubuntu1) ...
Setting up libmailtransport4 (4:4.9.2-0ubuntu1) ...
Setting up libmicroblog4 (4:4.9.2-0ubuntu1) ...
Setting up akonadi-server (1.8.1-0ubuntu1) ...
Setting up gconf-service (3.2.5-0ubuntu4) ...
Setting up libknewstuff2-4 (4:4.9.2-0ubuntu3) ...
Setting up libkprintutils4 (4:4.9.2-0ubuntu3) ...
Setting up ubuntu-release-upgrader-gtk (1:0.191) ...
Setting up libqt4-declarative:i386 (4:4.8.3+dfsg-0ubuntu3) ...
Setting up libkdeclarative5 (4:4.9.2-0ubuntu3) ...
Setting up libplasma3 (4:4.9.2-0ubuntu3) ...
Setting up libkactivities-bin (4:4.9.2-0ubuntu1) ...
Setting up libkactivities6 (4:4.9.2-0ubuntu1) ...
Setting up plasma-scriptengine-javascript (4:4.9.2-0ubuntu3) ...
Setting up gconf-service-backend (3.2.5-0ubuntu4) ...
Setting up gconf2 (3.2.5-0ubuntu4) ...
update-alternatives: using /usr/bin/gconftool-2 to provide /usr/bin/gconftool (gconftool) in auto mode
Setting up libgksu2-0 (2.0.13~pre1-5ubuntu3) ...
update-alternatives: using /usr/share/libgksu/debian/gconf-defaults.libgksu-sudo to provide /usr/share/gconf/defaults/10_libgksu (libgksu-gconf-defaults) in auto mode
Setting up gksu (2.0.2-6ubuntu2) ...
Setting up python3-pyqt4 (4.9.5-1ubuntu3) ...
Setting up update-manager (1:0.174.3) ...
Setting up update-notifier (0.126) ...
Processing triggers for sgml-base ...
Updating the super catalog...
Setting up kdoctools (4:4.9.2-0ubuntu3) ...
Setting up kdelibs5-plugins (4:4.9.2-0ubuntu3) ...
Setting up kde-runtime (4:4.9.2-0ubuntu3) ...
update-alternatives: using /usr/lib/kde4/libexec/kdesu-distrib/kdesu to provide /usr/lib/kde4/libexec/kdesu (kdesu) in auto mode
Setting up kdepim-runtime (4:4.9.2-0ubuntu2) ...
Setting up libkgapi0:i386 (0.4.2-0ubuntu1) ...
Setting up kdesudo (3.4.2.4-1ubuntu1) ...
update-alternatives: using /usr/bin/kdesudo to provide /usr/lib/kde4/libexec/kdesu (kdesu) in auto mode
Setting up python3-pykde4 (4:4.9.2-0ubuntu3) ...
Setting up ubuntu-release-upgrader-qt (1:0.191) ...
Setting up libkolab0 (0.2.1-0ubuntu2) ...
Processing triggers for libc-bin ...
ldconfig deferred processing now taking place
 -> Finished parsing the build-deps
adt-run: trace: & dsc0t-nose-tests: [----------------------------------------
+ buildtree=/tmp/tmp.wBHyYMFzgB/dsc0-build/ubuntu-release-upgrader-0.191/
+ shift
+ rm -rf -- /tmp/tmp.wBHyYMFzgB/dsc0t-nose-tests-testtmp /tmp/tmp.wBHyYMFzgB/dsc0t-nose-tests-testtmp/tmpdir /tmp/tmp.wBHyYMFzgB/dsc0t-nose-tests-testtmp/adttmp
+ mkdir -- /tmp/tmp.wBHyYMFzgB/dsc0t-nose-tests-testtmp /tmp/tmp.wBHyYMFzgB/dsc0t-nose-tests-testtmp/tmpdir /tmp/tmp.wBHyYMFzgB/dsc0t-nose-tests-testtmp/adttmp
adt-run: trace: & dsc0t-nose-tests:  - - - - - - - - - - results - - - - - - - - - -
dsc0t-nose-tests     FAIL non-zero exit status 1
adt-run: trace: & dsc0t-nose-tests:  - - - - - - - - - - stdout - - - - - - - - - -
...
(process:9118): Gtk-WARNING **: Locale not supported by C library.
	Using the fallback 'C' locale.
............................������F....
======================================================================
FAIL: Regression test for LP: #1068389
----------------------------------------------------------------------
Traceback (most recent call last):
  File "/tmp/tmp.wBHyYMFzgB/dsc0-build/ubuntu-release-upgrader-0.191/tests/test_view.py", line 22, in test_show_in_pager_lp1068389
    self.assertEqual(fp.read().decode("utf-8"), "������")
AssertionError: '' != '������'
+ ������

----------------------------------------------------------------------
Ran 36 tests in 28.409s

FAILED (failures=1)
adt-run: trace: & dsc0t-nose-tests: ----------------------------------------]
adt-run: trace1: ** needs_reset, previously=False
adt-run: trace: @@@@@@@@@@@@@@@@@@@@@@@@@@@@@@@@@@@@@@@@ tests done.
adt-run: trace: ** stop
adt-run: trace: ** close, scratch=tb-scratch~/tmp/tmp.wBHyYMFzgB:-/|/tmp/tmp.wBHyYMFzgB/!
+ RC=4
+ [ 0 -eq 1 ]
+ chown -R ubuntu /home/ubuntu/adt-log
+ chmod og+r /var/log/syslog
+ chmod og+r /var/crash/*
+ true
+ exit 4
+ RET=4
+ [ 0 -eq 1 ]
+ [ 4 -gt 0 ]
+ log_failure_msg adt-run exited with status 4.
+ log_msg Failure: adt-run exited with status 4.\n
+ date +%F %X
+ printf 2012-11-05 11:27:15: Failure: adt-run exited with status 4.\n
2012-11-05 11:27:15: Failure: adt-run exited with status 4.
+ [ 0 -eq 0 ]
+ mkdir -p <http://10.189.74.2:8080/job/raring-adt-ubuntu-release-upgrader/./ARCH=i386,label=albali/ws/results>
+ ssh -o UserKnownHostsFile=/dev/null -o StrictHostKeyChecking=no -o CheckHostIP=no -i /var/cache/adt/disks/adtkey -p 54323 -t -o BatchMode=yes -l ubuntu localhost sudo chown -R ubuntu /home/ubuntu/adt-log; find  -type f -empty | xargs rm
Pseudo-terminal will not be allocated because stdin is not a terminal.
Warning: Permanently added '[localhost]:54323' (ECDSA) to the list of known hosts.
sudo: unable to resolve host autopkgtest
find: `./.autopkgtest/gpg': Permission denied
+ scp -r -o UserKnownHostsFile=/dev/null -o StrictHostKeyChecking=no -o CheckHostIP=no -i /var/cache/adt/disks/adtkey -P 54323 ubuntu at localhost:/home/ubuntu/adt-log/*
    /var/crash/*crash /var/log/syslog <http://10.189.74.2:8080/job/raring-adt-ubuntu-release-upgrader/./ARCH=i386,label=albali/ws/results>
+ true
+ log_info_msg Test artifacts copied to <http://10.189.74.2:8080/job/raring-adt-ubuntu-release-upgrader/./ARCH=i386,label=albali/ws/results>
+ log_msg Info: Test artifacts copied to <http://10.189.74.2:8080/job/raring-adt-ubuntu-release-upgrader/./ARCH=i386,label=albali/ws/results\n>
+ date +%F %X
+ printf 2012-11-05 11:27:32: Info: Test artifacts copied to <http://10.189.74.2:8080/job/raring-adt-ubuntu-release-upgrader/./ARCH=i386,label=albali/ws/results\n>
2012-11-05 11:27:32: Info: Test artifacts copied to <http://10.189.74.2:8080/job/raring-adt-ubuntu-release-upgrader/./ARCH=i386,label=albali/ws/results>
+ [ -n 2012-11-05_10-33-19 ]
+ log_info_msg Updating Jenkins results
+ log_msg Info: Updating Jenkins results\n
+ date +%F %X
+ printf 2012-11-05 11:27:32: Info: Updating Jenkins results\n
2012-11-05 11:27:32: Info: Updating Jenkins results
+ res=fail
+ [ 4 -eq 0 ]
+ OPTS=-d
+ [ 0 -eq 1 ]
+ /var/lib/ubuntu-iso-testing/auto-package-testing/bin/../jenkins/update-adt-result -d -r raring ubuntu-release-upgrader i386 fail
2012-11-05 11:27:33,050 DEBUG Debug mode enabled
2012-11-05 11:27:33,050 DEBUG aptroot: /var/lib/ubuntu-iso-testing/auto-package-testing/aptroot/raring-amd64
2012-11-05 11:27:33,051 DEBUG Loading status from /var/lib/ubuntu-iso-testing/auto-package-testing/aptroot/raring-amd64/var/cache/adt/raring_amd64_ubuntu-release-upgrader
2012-11-05 11:27:33,051 DEBUG Writing status file
2012-11-05 11:27:33,052 INFO Writing results to /var/lib/ubuntu-iso-testing/auto-package-testing/aptroot/raring-amd64/../raring/raring_ubuntu-release-upgrader_20121105-112733
+ [ 0 -eq 0 ]
+ ssh -o UserKnownHostsFile=/dev/null -o StrictHostKeyChecking=no -o CheckHostIP=no -i /var/cache/adt/disks/adtkey -p 54323 -t -o BatchMode=yes -l ubuntu localhost sudo poweroff
Pseudo-terminal will not be allocated because stdin is not a terminal.
Warning: Permanently added '[localhost]:54323' (ECDSA) to the list of known hosts.
sudo: unable to resolve host autopkgtest
+ exit 4
+ on_exit
+ log_info_msg Cleaning up
+ log_msg Info: Cleaning up\n
+ date +%F %X
+ printf 2012-11-05 11:27:33: Info: Cleaning up\n
2012-11-05 11:27:33: Info: Cleaning up
+ [ -f /dev/shm/adt/raring-i386-ubuntu-release-upgrader-20121105_111408.img.pid ]
+ cat /dev/shm/adt/raring-i386-ubuntu-release-upgrader-20121105_111408.img.pid
+ kill -9 12020
+ rm -f /dev/shm/adt/raring-i386-ubuntu-release-upgrader-20121105_111408.img.pid
+ rm -f /dev/shm/adt/raring-i386-ubuntu-release-upgrader-20121105_111408.img
+ rm -f /var/lock/adt/ssh.54323.lock
+ rm -f /var/lock/adt/vnc.5911.lock
+ [ -d /tmp/adt-i386.GsdZL3 ]
+ rm -Rf /tmp/adt-i386.GsdZL3
+ exit 4
Build step 'Execute shell' marked build as failure
Archiving artifacts



More information about the ubuntu-testing-notifications mailing list