Build failed in Jenkins: quantal-adt-software-center » i386,albali #9

Jenkins Notification devnull at canonical.com
Fri Aug 24 10:03:02 UTC 2012


See <http://10.189.74.2:8080/job/quantal-adt-software-center/./ARCH=i386,label=albali/9/>

------------------------------------------
[...truncated 2556 lines...]
DBusException: org.freedesktop.DBus.Error.Spawn.ChildExited: Process /usr/share/oneconf/oneconf-service exited with status 1

----------------------------------------------------------------------
Ran 5 tests in 28.740s

FAILED (errors=1)
Fontconfig warning: "/etc/fonts/conf.d/69-language-selector-ja-jp.conf", line 141: Having multiple values in <test> isn't supported and may not works as expected
Fontconfig warning: "/etc/fonts/conf.d/69-language-selector-zh-tw.conf", line 79: Having multiple values in <test> isn't supported and may not works as expected
test_add_license_key_backend (tests.test_purchase_backend.TestPurchaseBackend) ... ERROR

======================================================================
ERROR: test_add_license_key_backend (tests.test_purchase_backend.TestPurchaseBackend)
----------------------------------------------------------------------
Traceback (most recent call last):
  File "tests/test_purchase_backend.py", line 44, in test_add_license_key_backend
    self.LICENSE_KEY)
  File "/usr/lib/python2.7/dist-packages/defer/__init__.py", line 599, in unwind_generator
    return _inline_callbacks(None, func(*args, **kwargs), Deferred())
TypeError: add_repo_add_key_and_install_app() takes at least 7 arguments (6 given)

----------------------------------------------------------------------
Ran 1 test in 0.047s

FAILED (errors=1)
Fontconfig warning: "/etc/fonts/conf.d/69-language-selector-ja-jp.conf", line 141: Having multiple values in <test> isn't supported and may not works as expected
Fontconfig warning: "/etc/fonts/conf.d/69-language-selector-zh-tw.conf", line 79: Having multiple values in <test> isn't supported and may not works as expected
2012-08-24 09:57:37,081 - softwarecenter.fixme - WARNING - logs to the root logger: '('softwarecenter/netstatus.py', 122, '__init_network_state')'
2012-08-24 09:57:37,081 - root - WARNING - failed to init network state watcher 'org.freedesktop.DBus.Error.ServiceUnknown: The name org.freedesktop.NetworkManager was not provided by any .service files'
2012-08-24 09:57:37,154 - softwarecenter.fixme - WARNING - logs to the root logger: '('/usr/lib/python2.7/dist-packages/gi/importer.py', 51, 'find_module')'
2012-08-24 09:57:37,154 - root - ERROR - Could not find any typelib for Gst
test_availablepane (tests.gtk3.test_search.TestSearch) ... 2012-08-24 09:57:37,201 - softwarecenter.fixme - WARNING - logs to the root logger: '('softwarecenter/netstatus.py', 151, 'test_ping')'
2012-08-24 09:57:37,201 - root - INFO - Attempting one time ping of archive.ubuntu.com to test if internet connectivity exists.
2012-08-24 09:57:37,287 - softwarecenter.db.pkginfo_impl.aptcache - INFO - aptcache.open()
2012-08-24 09:57:37,771 - softwarecenter.db.database - INFO - open() database: path=None use_axi=True use_agent=True
2012-08-24 09:57:37,773 - softwarecenter.db.pkginfo_impl.aptcache - INFO - aptcache.open()
2012-08-24 09:57:38,296 - softwarecenter.region - WARNING - failed to use geoclue: 'org.freedesktop.DBus.Error.ServiceUnknown: The name org.freedesktop.Geoclue.Master was not provided by any .service files'
ok
test_installedpane (tests.gtk3.test_search.TestSearch) ... 2012-08-24 09:57:44,396 - softwarecenter.db.pkginfo_impl.aptcache - INFO - aptcache.open()
2012-08-24 09:57:44,912 - softwarecenter.db.database - INFO - open() database: path=None use_axi=True use_agent=True
2012-08-24 09:57:44,914 - softwarecenter.db.pkginfo_impl.aptcache - INFO - aptcache.open()
ERROR

======================================================================
ERROR: test_installedpane (tests.gtk3.test_search.TestSearch)
----------------------------------------------------------------------
Traceback (most recent call last):
  File "tests/gtk3/test_search.py", line 15, in test_installedpane
    win = get_test_window_installedpane()
  File "tests/gtk3/windows.py", line 342, in get_test_window_installedpane
    w.init_view()
  File "softwarecenter/ui/gtk3/panes/installedpane.py", line 145, in init_view
    self.oneconf_handler = get_oneconf_handler(self.oneconf_viewpickler)
  File "softwarecenter/backend/oneconfhandler/__init__.py", line 32, in get_oneconf_handler
    oneconf_handler = OneConfHandler(oneconfviewpickler)
  File "softwarecenter/backend/oneconfhandler/core.py", line 56, in __init__
    self.oneconf = DbusConnect()
  File "/usr/lib/python2.7/dist-packages/oneconf/dbusconnect.py", line 153, in __init__
    HOSTS_OBJECT_NAME)
  File "/usr/lib/python2.7/dist-packages/dbus/bus.py", line 241, in get_object
    follow_name_owner_changes=follow_name_owner_changes)
  File "/usr/lib/python2.7/dist-packages/dbus/proxies.py", line 248, in __init__
    self._named_service = conn.activate_name_owner(bus_name)
  File "/usr/lib/python2.7/dist-packages/dbus/bus.py", line 180, in activate_name_owner
    self.start_service_by_name(bus_name)
  File "/usr/lib/python2.7/dist-packages/dbus/bus.py", line 278, in start_service_by_name
    'su', (bus_name, flags)))
  File "/usr/lib/python2.7/dist-packages/dbus/connection.py", line 651, in call_blocking
    message, timeout)
DBusException: org.freedesktop.DBus.Error.Spawn.ChildExited: Process /usr/share/oneconf/oneconf-service exited with status 1

----------------------------------------------------------------------
Ran 2 tests in 9.043s

FAILED (errors=1)
2012-08-24 09:57:47,234 - softwarecenter.fixme - WARNING - logs to the root logger: '('softwarecenter/netstatus.py', 168, 'test_ping')'
2012-08-24 09:57:47,234 - root - INFO - ping output: 'Internet connection available!
PING archive.ubuntu.com (91.189.92.188) 56(84) bytes of data.

--- archive.ubuntu.com ping statistics ---
1 packets transmitted, 0 received, 100% packet loss, time 0ms

'
Fontconfig warning: "/etc/fonts/conf.d/69-language-selector-ja-jp.conf", line 141: Having multiple values in <test> isn't supported and may not works as expected
Fontconfig warning: "/etc/fonts/conf.d/69-language-selector-zh-tw.conf", line 79: Having multiple values in <test> isn't supported and may not works as expected
WARNING:root:failed to init network state watcher 'org.freedesktop.DBus.Error.ServiceUnknown: The name org.freedesktop.NetworkManager was not provided by any .service files'
ERROR:root:Could not find any typelib for Gst
test_encoded_subdir (tests.gtk3.test_unity_launcher_integration.DesktopFilepathConversionTestCase) ... INFO:root:Attempting one time ping of archive.ubuntu.com to test if internet connectivity exists.
WARNING:softwarecenter.fixme:logs to the root logger: '('softwarecenter/netstatus.py', 151, 'test_ping')'
2012-08-24 09:58:33,597 - softwarecenter.fixme - WARNING - logs to the root logger: '('softwarecenter/netstatus.py', 151, 'test_ping')'
ok
test_no_value (tests.gtk3.test_unity_launcher_integration.DesktopFilepathConversionTestCase) ... ok
test_normal (tests.gtk3.test_unity_launcher_integration.DesktopFilepathConversionTestCase) ... 2012-08-24 09:58:33,596 - root - INFO - Attempting one time ping of archive.ubuntu.com to test if internet connectivity exists.
ok
test_purchase_via_software_center_agent (tests.gtk3.test_unity_launcher_integration.DesktopFilepathConversionTestCase) ... ok
INFO:softwarecenter.db.pkginfo_impl.aptcache:aptcache.open()
2012-08-24 09:58:33,686 - softwarecenter.db.pkginfo_impl.aptcache - INFO - aptcache.open()
INFO:softwarecenter.db.database:open() database: path=None use_axi=True use_agent=True
2012-08-24 09:58:34,181 - softwarecenter.db.database - INFO - open() database: path=None use_axi=True use_agent=True
INFO:softwarecenter.db.pkginfo_impl.aptcache:aptcache.open()
2012-08-24 09:58:34,183 - softwarecenter.db.pkginfo_impl.aptcache - INFO - aptcache.open()
WARNING:softwarecenter.region:failed to use geoclue: 'org.freedesktop.DBus.Error.ServiceUnknown: The name org.freedesktop.Geoclue.Master was not provided by any .service files'
2012-08-24 09:58:34,709 - softwarecenter.region - WARNING - failed to use geoclue: 'org.freedesktop.DBus.Error.ServiceUnknown: The name org.freedesktop.Geoclue.Master was not provided by any .service files'
test_unity_launcher_integration_details_view (tests.gtk3.test_unity_launcher_integration.TestUnityLauncherIntegration) ... FAIL
test_unity_launcher_integration_disabled (tests.gtk3.test_unity_launcher_integration.TestUnityLauncherIntegration) ... ok
test_unity_launcher_integration_launcher (tests.gtk3.test_unity_launcher_integration.TestUnityLauncherIntegration) ... FAIL
test_unity_launcher_integration_list_view (tests.gtk3.test_unity_launcher_integration.TestUnityLauncherIntegration) ... FAIL

======================================================================
FAIL: test_unity_launcher_integration_details_view (tests.gtk3.test_unity_launcher_integration.TestUnityLauncherIntegration)
----------------------------------------------------------------------
Traceback (most recent call last):
  File "/usr/lib/python2.7/dist-packages/mock.py", line 1224, in patched
    return func(*args, **keywargs)
  File "tests/gtk3/test_unity_launcher_integration.py", line 139, in test_unity_launcher_integration_details_view
    self.assertTrue(mock_send_application_to_launcher.called)
AssertionError: False is not true

======================================================================
FAIL: test_unity_launcher_integration_launcher (tests.gtk3.test_unity_launcher_integration.TestUnityLauncherIntegration)
----------------------------------------------------------------------
Traceback (most recent call last):
  File "/usr/lib/python2.7/dist-packages/mock.py", line 1224, in patched
    return func(*args, **keywargs)
  File "tests/gtk3/test_unity_launcher_integration.py", line 184, in test_unity_launcher_integration_launcher
    self.assertEqual(mock_send_application_to_launcher.called, res)
AssertionError: False != True

======================================================================
FAIL: test_unity_launcher_integration_list_view (tests.gtk3.test_unity_launcher_integration.TestUnityLauncherIntegration)
----------------------------------------------------------------------
Traceback (most recent call last):
  File "/usr/lib/python2.7/dist-packages/mock.py", line 1224, in patched
    return func(*args, **keywargs)
  File "tests/gtk3/test_unity_launcher_integration.py", line 120, in test_unity_launcher_integration_list_view
    self.assertTrue(mock_send_application_to_launcher.called)
AssertionError: False is not true

----------------------------------------------------------------------
Ran 8 tests in 9.303s

FAILED (failures=3)
INFO:root:ping output: 'Internet connection available!
PING archive.ubuntu.com (91.189.92.182) 56(84) bytes of data.

--- archive.ubuntu.com ping statistics ---
1 packets transmitted, 0 received, 100% packet loss, time 0ms

'
WARNING:softwarecenter.fixme:logs to the root logger: '('softwarecenter/netstatus.py', 168, 'test_ping')'
2012-08-24 09:58:43,615 - softwarecenter.fixme - WARNING - logs to the root logger: '('softwarecenter/netstatus.py', 168, 'test_ping')'
2012-08-24 09:58:43,615 - root - INFO - ping output: 'Internet connection available!
PING archive.ubuntu.com (91.189.92.182) 56(84) bytes of data.

--- archive.ubuntu.com ping statistics ---
1 packets transmitted, 0 received, 100% packet loss, time 0ms

'
Fontconfig warning: "/etc/fonts/conf.d/69-language-selector-ja-jp.conf", line 141: Having multiple values in <test> isn't supported and may not works as expected
Fontconfig warning: "/etc/fonts/conf.d/69-language-selector-zh-tw.conf", line 79: Having multiple values in <test> isn't supported and may not works as expected
test_expunge_cache (tests.test_utils.TestExpungeCache) ... Need either --by-days or --by-unsuccessful-http-states argument
DEBUG:root:Deleting: /tmp/tmp.qPaAkGi55w/dsc0t-run-tests-testtmp/tmpdir/tmp5Y01_hs-c-testsuite/foo-301
DEBUG:root:Skipping files with unknown header: 'foo-random'
DEBUG:root:Skipping files with unknown header: 'expunge.lock'
DEBUG:root:Skipping files with unknown header: 'foo-random'
DEBUG:root:Skipping files with unknown header: 'expunge.lock'
DEBUG:root:mtime of 'foo-200': '1.0
DEBUG:root:Deleting: /tmp/tmp.qPaAkGi55w/dsc0t-run-tests-testtmp/tmpdir/tmp5Y01_hs-c-testsuite/foo-200
ok
test_expunge_cache_lock (tests.test_utils.TestExpungeCache) ... ok
test_oem_channel_extractor (tests.test_utils.TestExpungeCache) ... ok
test_capitalize_first_word (tests.test_utils.TestSCUtils) ... ok
test_clear_credentials (tests.test_utils.TestSCUtils) ... ok
test_encode (tests.test_utils.TestSCUtils) ... ok
test_ensure_file_writable_and_delete_if_not (tests.test_utils.TestSCUtils) ... FAIL
test_get_file_path_from_iconname (tests.test_utils.TestSCUtils) ... ok
test_get_http_proxy_from_gsettings (tests.test_utils.TestSCUtils) ... ok
test_get_nice_date_string (tests.test_utils.TestSCUtils) ... ok
test_get_title_from_html (tests.test_utils.TestSCUtils) ... ok
test_get_uuid (tests.test_utils.TestSCUtils) ... ok
test_lists_filename (tests.test_utils.TestSCUtils) ... ok
test_make_string_from_list (tests.test_utils.TestSCUtils) ... ok
test_no_display_desktop_file (tests.test_utils.TestSCUtils) ... ok
test_safe_makedirs (tests.test_utils.TestSCUtils) ... FAIL
test_split_icon_ext (tests.test_utils.TestSCUtils) ... ok

======================================================================
FAIL: test_ensure_file_writable_and_delete_if_not (tests.test_utils.TestSCUtils)
----------------------------------------------------------------------
Traceback (most recent call last):
  File "tests/test_utils.py", line 196, in test_ensure_file_writable_and_delete_if_not
    self.assertFalse(os.access(test_file_not_writeable.name, os.W_OK))
AssertionError: True is not false

======================================================================
FAIL: test_safe_makedirs (tests.test_utils.TestSCUtils)
----------------------------------------------------------------------
Traceback (most recent call last):
  File "tests/test_utils.py", line 221, in test_safe_makedirs
    self.assertRaises(OSError, safe_makedirs, target)
AssertionError: OSError not raised

----------------------------------------------------------------------
Ran 17 tests in 3.477s

FAILED (failures=2)
adt-run: trace: & dsc0t-run-tests: ----------------------------------------]
adt-run: trace1: ** needs_reset, previously=False
adt-run: trace: @@@@@@@@@@@@@@@@@@@@@@@@@@@@@@@@@@@@@@@@ tests done.
adt-run: trace: ** stop
adt-run: trace: ** close, scratch=tb-scratch~/tmp/tmp.qPaAkGi55w:-/|/tmp/tmp.qPaAkGi55w/!
+ RET=4
+ [ 4 -gt 0 ]
+ log_failure_msg adt-run exited with status 4.
+ log_msg Failure: adt-run exited with status 4.\n
+ date +%F %X
+ printf 2012-08-24 10:02:54: Failure: adt-run exited with status 4.\n
2012-08-24 10:02:54: Failure: adt-run exited with status 4.
+ mkdir -p <http://10.189.74.2:8080/job/quantal-adt-software-center/./ARCH=i386,label=albali/ws/results>
+ ssh -o UserKnownHostsFile=/dev/null -o StrictHostKeyChecking=no -o CheckHostIP=no -i /var/cache/adt/disks/adtkey -p 54323 -t -o BatchMode=yes -l ubuntu localhost sudo chown -R ubuntu /home/ubuntu/adt-log
Pseudo-terminal will not be allocated because stdin is not a terminal.
Warning: Permanently added '[localhost]:54323' (ECDSA) to the list of known hosts.
sudo: unable to resolve host autopkgtest
+ scp -r -o UserKnownHostsFile=/dev/null -o StrictHostKeyChecking=no -o CheckHostIP=no -i /var/cache/adt/disks/adtkey -P 54323 ubuntu at localhost:/home/ubuntu/adt-log/* <http://10.189.74.2:8080/job/quantal-adt-software-center/./ARCH=i386,label=albali/ws/results>
Warning: Permanently added '[localhost]:54323' (ECDSA) to the list of known hosts.
+ scp -r -o UserKnownHostsFile=/dev/null -o StrictHostKeyChecking=no -o CheckHostIP=no -i /var/cache/adt/disks/adtkey -P 54323 ubuntu at localhost:/var/crash/*crash <http://10.189.74.2:8080/job/quantal-adt-software-center/./ARCH=i386,label=albali/ws/results>
Warning: Permanently added '[localhost]:54323' (ECDSA) to the list of known hosts.
scp: /var/crash/_usr_share_apport_recoverable_problem.0.crash: Permission denied
+ true
+ ssh -o UserKnownHostsFile=/dev/null -o StrictHostKeyChecking=no -o CheckHostIP=no -i /var/cache/adt/disks/adtkey -p 54323 -t -o BatchMode=yes -l ubuntu localhost sudo poweroff
Pseudo-terminal will not be allocated because stdin is not a terminal.
Warning: Permanently added '[localhost]:54323' (ECDSA) to the list of known hosts.
sudo: unable to resolve host autopkgtest
+ exit 4
+ on_exit
+ log_info_msg Cleaning up
+ log_msg Info: Cleaning up\n
+ date +%F %X
+ printf 2012-08-24 10:03:02: Info: Cleaning up\n
2012-08-24 10:03:02: Info: Cleaning up
+ [ -f /dev/shm/adt/quantal-i386-software-center-20120824_094118.img.pid ]
+ cat /dev/shm/adt/quantal-i386-software-center-20120824_094118.img.pid
+ kill -9 17410
+ rm /dev/shm/adt/quantal-i386-software-center-20120824_094118.img.pid
+ rm /dev/shm/adt/quantal-i386-software-center-20120824_094118.img
+ [ -d /tmp/adt-i386.OCkTS6 ]
+ rm -Rf /tmp/adt-i386.OCkTS6
+ exit 4
Build step 'Execute shell' marked build as failure
Archiving artifacts



More information about the ubuntu-testing-notifications mailing list