Build failed in Jenkins: precise-upgrade-lucid-desktop » amd64,lts,ubuntu,upgrade-test #202

Jenkins Notification devnull at
Fri Aug 3 15:09:35 UTC 2012

See <,LTS=lts,PROFILE=ubuntu,label=upgrade-test/202/>

Started by upstream project "precise-upgrade-lucid-desktop" build number 202
[EnvInject] - Loading node environment variables.
Building remotely on alderamin-upgrade
No emails were triggered.
[upgrade-test] $ /bin/sh -x /tmp/
+ rm -Rf lts-ubuntu-amd64
+ BASEDIR=/home/upgrade-tester/auto-upgrade-testing
+ [ lts = non-lts ]
+ ARCHEXT=amd64
+ PROFILENAME=lts-ubuntu-amd64
+ [ amd64 = i386 ]
+ echo Running profile lts-ubuntu-amd64
Running profile lts-ubuntu-amd64
+ cd /home/upgrade-tester/auto-upgrade-testing
+ python bin/auto-upgrade-tester share/profiles/lts-ubuntu-amd64
Testing 'share/profiles/lts-ubuntu-amd64'
Port 54322 already locked. Skipping!
using ssh port: 54323
Port 5901 already in use. Skipping!
Port 5902 already in use. Skipping!
Port 5903 already locked. Skipping!
using VncNum: 5904
Storing the result in '/home/upgrade-tester/auto-upgrade-tester/result/lts-ubuntu-amd64'
2012-08-03 15:08:44.058455 log started
Not bootstrapping again, we have a cached BaseImage
Starting for upgrade
Starting ['kvm', '-hda', '/home/upgrade-tester/auto-upgrade-tester/test-image.lts-ubuntu-amd64', '-monitor', 'stdio', '-localtime', '-no-reboot', '-net', 'nic,model=virtio', '-net', 'user', '-redir', 'tcp:54323::22', '-vnc', 'localhost:4', '-m', '1536']
qemu stopped unexpectedly with exit code '1'
FAILED: upgrade for 'share/profiles/lts-ubuntu-amd64'
Failed to upgrade share/profiles/lts-ubuntu-amd64
Logs can be found here:
2012-08-03 15:09:33.261427 log ended.
Duration: 0:00:49.202972
Profile 'share/profiles/lts-ubuntu-amd64' FAILED
stop pid:  <subprocess.Popen object at 0x1df5cd0>
waiting for qemu to shutdown
poll() returned
qemu stopped
Releasing lock: /var/lock/auto-upgrade-tester.54323.lock
Releasing lock: /var/lock/auto-upgrade-tester.5904.lock
+ cp -ar /home/upgrade-tester/auto-upgrade-tester/result/lts-ubuntu-amd64/ <,LTS=lts,PROFILE=ubuntu,label=upgrade-test/202/artifact/>
Archiving artifacts
Recording test results
No test report files were found. Configuration error?
Build step 'Publish JUnit test result report' changed build result to FAILURE

More information about the ubuntu-testing-notifications mailing list