Build failed in Jenkins: quantal-adt-ubiquity » amd64,albali #47

Jenkins Notification devnull at canonical.com
Fri Jun 29 12:11:18 UTC 2012


See <http://10.189.74.2:8080/job/quantal-adt-ubiquity/./ARCH=amd64,label=albali/47/>

------------------------------------------
[...truncated 2948 lines...]
----------------------------------------------------------------------
Traceback (most recent call last):
  File "/tmp/tmp.BmllfbiEYT/dsc0-build/ubiquity-2.11.7/tests/test_ubi_partman.py", line 156, in setUp
    self.page.db = debconf.DebconfCommunicator('ubi-test', cloexec=True)
  File "/usr/lib/python3/dist-packages/debconf.py", line 129, in __init__
    write=self.dccomm.stdin)
  File "/usr/lib/python3/dist-packages/debconf.py", line 50, in __init__
    self.setUp(title)
  File "/usr/lib/python3/dist-packages/debconf.py", line 53, in setUp
    self.version = self.version(2)
  File "/usr/lib/python3/dist-packages/debconf.py", line 62, in <lambda>
    lambda *args, **kw: self.command(command, *args, **kw))
  File "/usr/lib/python3/dist-packages/debconf.py", line 83, in command
    status = int(status)
ValueError: invalid literal for int() with base 10: ''

======================================================================
ERROR: test_description (test_ubi_partman.TestPage)
----------------------------------------------------------------------
Traceback (most recent call last):
  File "/tmp/tmp.BmllfbiEYT/dsc0-build/ubiquity-2.11.7/tests/test_ubi_partman.py", line 156, in setUp
    self.page.db = debconf.DebconfCommunicator('ubi-test', cloexec=True)
  File "/usr/lib/python3/dist-packages/debconf.py", line 129, in __init__
    write=self.dccomm.stdin)
  File "/usr/lib/python3/dist-packages/debconf.py", line 50, in __init__
    self.setUp(title)
  File "/usr/lib/python3/dist-packages/debconf.py", line 53, in setUp
    self.version = self.version(2)
  File "/usr/lib/python3/dist-packages/debconf.py", line 62, in <lambda>
    lambda *args, **kw: self.command(command, *args, **kw))
  File "/usr/lib/python3/dist-packages/debconf.py", line 83, in command
    status = int(status)
ValueError: invalid literal for int() with base 10: ''

======================================================================
ERROR: test_method_description (test_ubi_partman.TestPage)
----------------------------------------------------------------------
Traceback (most recent call last):
  File "/tmp/tmp.BmllfbiEYT/dsc0-build/ubiquity-2.11.7/tests/test_ubi_partman.py", line 156, in setUp
    self.page.db = debconf.DebconfCommunicator('ubi-test', cloexec=True)
  File "/usr/lib/python3/dist-packages/debconf.py", line 129, in __init__
    write=self.dccomm.stdin)
  File "/usr/lib/python3/dist-packages/debconf.py", line 50, in __init__
    self.setUp(title)
  File "/usr/lib/python3/dist-packages/debconf.py", line 53, in setUp
    self.version = self.version(2)
  File "/usr/lib/python3/dist-packages/debconf.py", line 62, in <lambda>
    lambda *args, **kw: self.command(command, *args, **kw))
  File "/usr/lib/python3/dist-packages/debconf.py", line 83, in command
    status = int(status)
ValueError: invalid literal for int() with base 10: ''

======================================================================
ERROR: test_install_grub_offers_to_install_to_all (test_ubi_partman.TestPageGrub)
----------------------------------------------------------------------
Traceback (most recent call last):
  File "/tmp/tmp.BmllfbiEYT/dsc0-build/ubiquity-2.11.7/tests/test_ubi_partman.py", line 156, in setUp
    self.page.db = debconf.DebconfCommunicator('ubi-test', cloexec=True)
  File "/usr/lib/python3/dist-packages/debconf.py", line 129, in __init__
    write=self.dccomm.stdin)
  File "/usr/lib/python3/dist-packages/debconf.py", line 50, in __init__
    self.setUp(title)
  File "/usr/lib/python3/dist-packages/debconf.py", line 53, in setUp
    self.version = self.version(2)
  File "/usr/lib/python3/dist-packages/debconf.py", line 62, in <lambda>
    lambda *args, **kw: self.command(command, *args, **kw))
  File "/usr/lib/python3/dist-packages/debconf.py", line 83, in command
    status = int(status)
ValueError: invalid literal for int() with base 10: ''

======================================================================
ERROR: test_install_grub_offers_to_install_to_all_but_jfs (test_ubi_partman.TestPageGrub)
----------------------------------------------------------------------
Traceback (most recent call last):
  File "/tmp/tmp.BmllfbiEYT/dsc0-build/ubiquity-2.11.7/tests/test_ubi_partman.py", line 156, in setUp
    self.page.db = debconf.DebconfCommunicator('ubi-test', cloexec=True)
  File "/usr/lib/python3/dist-packages/debconf.py", line 129, in __init__
    write=self.dccomm.stdin)
  File "/usr/lib/python3/dist-packages/debconf.py", line 50, in __init__
    self.setUp(title)
  File "/usr/lib/python3/dist-packages/debconf.py", line 53, in setUp
    self.version = self.version(2)
  File "/usr/lib/python3/dist-packages/debconf.py", line 62, in <lambda>
    lambda *args, **kw: self.command(command, *args, **kw))
  File "/usr/lib/python3/dist-packages/debconf.py", line 83, in command
    status = int(status)
ValueError: invalid literal for int() with base 10: ''

======================================================================
ERROR: test_install_grub_offers_to_install_to_disk (test_ubi_partman.TestPageGrub)
----------------------------------------------------------------------
Traceback (most recent call last):
  File "/tmp/tmp.BmllfbiEYT/dsc0-build/ubiquity-2.11.7/tests/test_ubi_partman.py", line 156, in setUp
    self.page.db = debconf.DebconfCommunicator('ubi-test', cloexec=True)
  File "/usr/lib/python3/dist-packages/debconf.py", line 129, in __init__
    write=self.dccomm.stdin)
  File "/usr/lib/python3/dist-packages/debconf.py", line 50, in __init__
    self.setUp(title)
  File "/usr/lib/python3/dist-packages/debconf.py", line 53, in setUp
    self.version = self.version(2)
  File "/usr/lib/python3/dist-packages/debconf.py", line 62, in <lambda>
    lambda *args, **kw: self.command(command, *args, **kw))
  File "/usr/lib/python3/dist-packages/debconf.py", line 83, in command
    status = int(status)
ValueError: invalid literal for int() with base 10: ''

======================================================================
ERROR: test_install_grub_to_invalid_filesystem (test_ubi_partman.TestPageGrub)
----------------------------------------------------------------------
Traceback (most recent call last):
  File "/tmp/tmp.BmllfbiEYT/dsc0-build/ubiquity-2.11.7/tests/test_ubi_partman.py", line 156, in setUp
    self.page.db = debconf.DebconfCommunicator('ubi-test', cloexec=True)
  File "/usr/lib/python3/dist-packages/debconf.py", line 129, in __init__
    write=self.dccomm.stdin)
  File "/usr/lib/python3/dist-packages/debconf.py", line 50, in __init__
    self.setUp(title)
  File "/usr/lib/python3/dist-packages/debconf.py", line 53, in setUp
    self.version = self.version(2)
  File "/usr/lib/python3/dist-packages/debconf.py", line 62, in <lambda>
    lambda *args, **kw: self.command(command, *args, **kw))
  File "/usr/lib/python3/dist-packages/debconf.py", line 83, in command
    status = int(status)
ValueError: invalid literal for int() with base 10: ''

======================================================================
ERROR: test_install_grub_to_mixed_filesystems (test_ubi_partman.TestPageGrub)
----------------------------------------------------------------------
Traceback (most recent call last):
  File "/tmp/tmp.BmllfbiEYT/dsc0-build/ubiquity-2.11.7/tests/test_ubi_partman.py", line 156, in setUp
    self.page.db = debconf.DebconfCommunicator('ubi-test', cloexec=True)
  File "/usr/lib/python3/dist-packages/debconf.py", line 129, in __init__
    write=self.dccomm.stdin)
  File "/usr/lib/python3/dist-packages/debconf.py", line 50, in __init__
    self.setUp(title)
  File "/usr/lib/python3/dist-packages/debconf.py", line 53, in setUp
    self.version = self.version(2)
  File "/usr/lib/python3/dist-packages/debconf.py", line 62, in <lambda>
    lambda *args, **kw: self.command(command, *args, **kw))
  File "/usr/lib/python3/dist-packages/debconf.py", line 83, in command
    status = int(status)
ValueError: invalid literal for int() with base 10: ''

======================================================================
ERROR: test_install_grub_to_valid_filesystem (test_ubi_partman.TestPageGrub)
----------------------------------------------------------------------
Traceback (most recent call last):
  File "/tmp/tmp.BmllfbiEYT/dsc0-build/ubiquity-2.11.7/tests/test_ubi_partman.py", line 156, in setUp
    self.page.db = debconf.DebconfCommunicator('ubi-test', cloexec=True)
  File "/usr/lib/python3/dist-packages/debconf.py", line 129, in __init__
    write=self.dccomm.stdin)
  File "/usr/lib/python3/dist-packages/debconf.py", line 50, in __init__
    self.setUp(title)
  File "/usr/lib/python3/dist-packages/debconf.py", line 53, in setUp
    self.version = self.version(2)
  File "/usr/lib/python3/dist-packages/debconf.py", line 62, in <lambda>
    lambda *args, **kw: self.command(command, *args, **kw))
  File "/usr/lib/python3/dist-packages/debconf.py", line 83, in command
    status = int(status)
ValueError: invalid literal for int() with base 10: ''

======================================================================
ERROR: test_maybe_update_dont_install (test_ubi_partman.TestPageGrub)
----------------------------------------------------------------------
Traceback (most recent call last):
  File "/tmp/tmp.BmllfbiEYT/dsc0-build/ubiquity-2.11.7/tests/test_ubi_partman.py", line 156, in setUp
    self.page.db = debconf.DebconfCommunicator('ubi-test', cloexec=True)
  File "/usr/lib/python3/dist-packages/debconf.py", line 129, in __init__
    write=self.dccomm.stdin)
  File "/usr/lib/python3/dist-packages/debconf.py", line 50, in __init__
    self.setUp(title)
  File "/usr/lib/python3/dist-packages/debconf.py", line 53, in setUp
    self.version = self.version(2)
  File "/usr/lib/python3/dist-packages/debconf.py", line 62, in <lambda>
    lambda *args, **kw: self.command(command, *args, **kw))
  File "/usr/lib/python3/dist-packages/debconf.py", line 83, in command
    status = int(status)
ValueError: invalid literal for int() with base 10: ''

======================================================================
ERROR: test_maybe_update_install (test_ubi_partman.TestPageGrub)
----------------------------------------------------------------------
Traceback (most recent call last):
  File "/tmp/tmp.BmllfbiEYT/dsc0-build/ubiquity-2.11.7/tests/test_ubi_partman.py", line 156, in setUp
    self.page.db = debconf.DebconfCommunicator('ubi-test', cloexec=True)
  File "/usr/lib/python3/dist-packages/debconf.py", line 129, in __init__
    write=self.dccomm.stdin)
  File "/usr/lib/python3/dist-packages/debconf.py", line 50, in __init__
    self.setUp(title)
  File "/usr/lib/python3/dist-packages/debconf.py", line 53, in setUp
    self.version = self.version(2)
  File "/usr/lib/python3/dist-packages/debconf.py", line 62, in <lambda>
    lambda *args, **kw: self.command(command, *args, **kw))
  File "/usr/lib/python3/dist-packages/debconf.py", line 83, in command
    status = int(status)
ValueError: invalid literal for int() with base 10: ''

======================================================================
ERROR: test_secure_ap_can_enter_password (test_wireless.WirelessTests)
----------------------------------------------------------------------
Traceback (most recent call last):
  File "/usr/lib/python3/dist-packages/mock.py", line 1224, in patched
    return func(*args, **keywargs)
  File "/tmp/tmp.BmllfbiEYT/dsc0-build/ubiquity-2.11.7/tests/test_wireless.py", line 19, in setUp
    self.gtk = self.ubi_wireless.PageGtk(mock.Mock())
  File "/usr/lib/ubiquity/plugins/ubi-wireless.py", line 58, in __init__
    self.state = self.nmwidget.get_state()
  File "/usr/lib/ubiquity/ubiquity/nm.py", line 427, in get_state
    return self.view.get_state()
AttributeError: 'NetworkManagerWidget' object has no attribute 'view'

----------------------------------------------------------------------
Ran 89 tests in 5.996s

FAILED (errors=24, skipped=1)
adt-run: trace: & dsc0t-unit: ----------------------------------------]
adt-run: trace1: ** needs_reset, previously=False
adt-run: trace: @@@@@@@@@@@@@@@@@@@@@@@@@@@@@@@@@@@@@@@@ tests done.
adt-run: trace: ** stop
adt-run: trace: ** close, scratch=tb-scratch~/tmp/tmp.BmllfbiEYT:-/|/tmp/tmp.BmllfbiEYT/!
+ RET=4
+ [ 4 -gt 0 ]
+ log_failure_msg adt-run exited with status 4.
+ log_msg Failure: adt-run exited with status 4.\n
+ date +%F %X
+ printf 2012-06-29 12:11:14: Failure: adt-run exited with status 4.\n
2012-06-29 12:11:14: Failure: adt-run exited with status 4.
+ mkdir -p <http://10.189.74.2:8080/job/quantal-adt-ubiquity/./ARCH=amd64,label=albali/ws/results>
+ ssh -o UserKnownHostsFile=/dev/null -o StrictHostKeyChecking=no -o CheckHostIP=no -i /tmp/adt/disks/adtkey -p 54323 -t -o BatchMode=yes -l ubuntu localhost sudo chown -R ubuntu /home/ubuntu/adt-log
Pseudo-terminal will not be allocated because stdin is not a terminal.
Warning: Permanently added '[localhost]:54323' (ECDSA) to the list of known hosts.
sudo: unable to resolve host autopkgtest
+ scp -r -o UserKnownHostsFile=/dev/null -o StrictHostKeyChecking=no -o CheckHostIP=no -i /tmp/adt/disks/adtkey -P 54323 ubuntu at localhost:/home/ubuntu/adt-log/* <http://10.189.74.2:8080/job/quantal-adt-ubiquity/./ARCH=amd64,label=albali/ws/results>
Warning: Permanently added '[localhost]:54323' (ECDSA) to the list of known hosts.
+ scp -r -o UserKnownHostsFile=/dev/null -o StrictHostKeyChecking=no -o CheckHostIP=no -i /tmp/adt/disks/adtkey -P 54323 ubuntu at localhost:/var/crash/*crash <http://10.189.74.2:8080/job/quantal-adt-ubiquity/./ARCH=amd64,label=albali/ws/results>
Warning: Permanently added '[localhost]:54323' (ECDSA) to the list of known hosts.
scp: /var/crash/*crash: No such file or directory
+ true
+ ssh -o UserKnownHostsFile=/dev/null -o StrictHostKeyChecking=no -o CheckHostIP=no -i /tmp/adt/disks/adtkey -p 54323 -t -o BatchMode=yes -l ubuntu localhost sudo poweroff
Pseudo-terminal will not be allocated because stdin is not a terminal.
Warning: Permanently added '[localhost]:54323' (ECDSA) to the list of known hosts.
sudo: unable to resolve host autopkgtest
+ cat /dev/shm/adt/quantal-amd64-ubiquity-20120629_114209.img.pid
+ kill -9 102715
+ rm /dev/shm/adt/quantal-amd64-ubiquity-20120629_114209.img.pid
+ rm /dev/shm/adt/quantal-amd64-ubiquity-20120629_114209.img
+ rm -Rf /tmp/adt-amd64.sRcBu8
+ exit 4
Build step 'Execute shell' marked build as failure
Archiving artifacts



More information about the ubuntu-testing-notifications mailing list