Build failed in Jenkins: quantal-adt-ubuntu-drivers-common » amd64,albali #7

Jenkins Notification devnull at canonical.com
Fri Jun 29 08:18:07 UTC 2012


See <http://10.189.74.2:8080/job/quantal-adt-ubuntu-drivers-common/./ARCH=amd64,label=albali/7/>

------------------------------------------
[...truncated 740 lines...]
   -> Trying nvidia-common
 -> Installing  ubuntu-drivers-common dh-modaliases nvidia-common
Reading package lists...
Building dependency tree...
Reading state information...
The following packages were automatically installed and are no longer required:
  linux-headers-3.5.0-1 linux-headers-3.5.0-1-generic
Use 'apt-get autoremove' to remove them.
The following extra packages will be installed:
  alsa-utils libasound2 libsamplerate0 linux-sound-base python3-xkit
Suggested packages:
  libasound2-plugins libasound2-python packagekit-system-interface
Recommended packages:
  alsa-base
The following NEW packages will be installed:
  alsa-utils dh-modaliases libasound2 libsamplerate0 linux-sound-base
  nvidia-common python3-xkit ubuntu-drivers-common
0 upgraded, 8 newly installed, 0 to remove and 0 not upgraded.
Need to get 2,967 kB of archives.
After this operation, 5,620 kB of additional disk space will be used.
Get:1 http://archive.ubuntu.com/ubuntu/ quantal/main linux-sound-base all 1.0.25+dfsg-0ubuntu2 [15.2 kB]
Get:2 http://archive.ubuntu.com/ubuntu/ quantal/main libasound2 amd64 1.0.25-3ubuntu1 [429 kB]
Get:3 http://archive.ubuntu.com/ubuntu/ quantal/main libsamplerate0 amd64 0.1.8-5 [1,342 kB]
Get:4 http://archive.ubuntu.com/ubuntu/ quantal/main alsa-utils amd64 1.0.25-1ubuntu5 [1,118 kB]
Get:5 http://archive.ubuntu.com/ubuntu/ quantal/main python3-xkit all 0.5.0 [21.3 kB]
Get:6 http://archive.ubuntu.com/ubuntu/ quantal/main ubuntu-drivers-common amd64 1:0.2.58 [31.2 kB]
Get:7 http://archive.ubuntu.com/ubuntu/ quantal/main dh-modaliases all 1:0.2.58 [9,606 B]
Get:8 http://archive.ubuntu.com/ubuntu/ quantal/main nvidia-common amd64 1:0.2.58 [1,280 B]
Preconfiguring packages ...
Fetched 2,967 kB in 2s (1,041 kB/s)
Selecting previously unselected package linux-sound-base.
(Reading database ... 84985 files and directories currently installed.)
Unpacking linux-sound-base (from .../linux-sound-base_1.0.25+dfsg-0ubuntu2_all.deb) ...
Selecting previously unselected package libasound2:amd64.
Unpacking libasound2:amd64 (from .../libasound2_1.0.25-3ubuntu1_amd64.deb) ...
Selecting previously unselected package libsamplerate0:amd64.
Unpacking libsamplerate0:amd64 (from .../libsamplerate0_0.1.8-5_amd64.deb) ...
Selecting previously unselected package alsa-utils.
Unpacking alsa-utils (from .../alsa-utils_1.0.25-1ubuntu5_amd64.deb) ...
Selecting previously unselected package python3-xkit.
Unpacking python3-xkit (from .../python3-xkit_0.5.0_all.deb) ...
Selecting previously unselected package ubuntu-drivers-common.
Unpacking ubuntu-drivers-common (from .../ubuntu-drivers-common_1%3a0.2.58_amd64.deb) ...
Selecting previously unselected package dh-modaliases.
Unpacking dh-modaliases (from .../dh-modaliases_1%3a0.2.58_all.deb) ...
Selecting previously unselected package nvidia-common.
Unpacking nvidia-common (from .../nvidia-common_1%3a0.2.58_amd64.deb) ...
Processing triggers for ureadahead ...
Processing triggers for man-db ...
Setting up linux-sound-base (1.0.25+dfsg-0ubuntu2) ...
Setting up libasound2:amd64 (1.0.25-3ubuntu1) ...
Setting up libsamplerate0:amd64 (0.1.8-5) ...
Setting up alsa-utils (1.0.25-1ubuntu5) ...
Setting up python3-xkit (0.5.0) ...
Setting up dh-modaliases (1:0.2.58) ...
Processing triggers for ureadahead ...
Setting up ubuntu-drivers-common (1:0.2.58) ...
Processing triggers for ureadahead ...
Setting up nvidia-common (1:0.2.58) ...
Processing triggers for libc-bin ...
ldconfig deferred processing now taking place
 -> Finished parsing the build-deps
adt-run: trace: & dsc0t-system: [----------------------------------------
+ buildtree=/tmp/tmp.zYKDcL5ALn/dsc0-build/ubuntu-drivers-common-0.2.58/
+ shift
+ rm -rf -- /tmp/tmp.zYKDcL5ALn/dsc0t-system-testtmp /tmp/tmp.zYKDcL5ALn/dsc0t-system-testtmp/tmpdir /tmp/tmp.zYKDcL5ALn/dsc0t-system-testtmp/adttmp
+ mkdir -- /tmp/tmp.zYKDcL5ALn/dsc0t-system-testtmp /tmp/tmp.zYKDcL5ALn/dsc0t-system-testtmp/tmpdir /tmp/tmp.zYKDcL5ALn/dsc0t-system-testtmp/adttmp
adt-run: trace: & dsc0t-system:  - - - - - - - - - - results - - - - - - - - - -
dsc0t-system         FAIL non-zero exit status 1
adt-run: trace: & dsc0t-system:  - - - - - - - - - - stdout - - - - - - - - - -
test_debug (__main__.TestSystem)
ubuntu-drivers debug succeeds ... ok
test_list (__main__.TestSystem)
ubuntu-drivers list succeeds ... ok
test_bcmwl (__main__.TestUbuntuDrivers)
bcmwl-kernel-source ... ok
test_fglrx (__main__.TestUbuntuDrivers)
fglrx ... 
--- Error output from package installation ---

Extracting templates from packages: 51%
Extracting templates from packages: 100%
update-alternatives: warning: skip creation of /etc/OpenCL/vendors/amdocl32.icd because associated file /usr/lib/fglrx/etc/OpenCL/vendors/amdocl32.icd (of link group x86_64-linux-gnu_gl_conf) doesn't exist.
update-alternatives: warning: forcing reinstallation of alternative /usr/lib/fglrx/ld.so.conf because link group x86_64-linux-gnu_gl_conf is broken.
update-alternatives: warning: skip creation of /etc/OpenCL/vendors/amdocl32.icd because associated file /usr/lib/fglrx/etc/OpenCL/vendors/amdocl32.icd (of link group x86_64-linux-gnu_gl_conf) doesn't exist.

------
FAIL
test_fglrx_updates (__main__.TestUbuntuDrivers)
fglrx-updates ... 
--- Error output from package installation ---

Extracting templates from packages: 51%
Extracting templates from packages: 100%
update-alternatives: warning: skip creation of /etc/OpenCL/vendors/amdocl32.icd because associated file /usr/lib/fglrx/etc/OpenCL/vendors/amdocl32.icd (of link group x86_64-linux-gnu_gl_conf) doesn't exist.
update-alternatives: warning: forcing reinstallation of alternative /usr/lib/fglrx/ld.so.conf because link group x86_64-linux-gnu_gl_conf is broken.
update-alternatives: warning: skip creation of /etc/OpenCL/vendors/amdocl32.icd because associated file /usr/lib/fglrx/etc/OpenCL/vendors/amdocl32.icd (of link group x86_64-linux-gnu_gl_conf) doesn't exist.

------
FAIL
test_nvidia_current (__main__.TestUbuntuDrivers)
nvidia-current ... FAIL
test_nvidia_current_updates (__main__.TestUbuntuDrivers)
nvidia-current-updates ... FAIL
test_sl_modem (__main__.TestUbuntuDrivers)
sl-modem-dkms ... 
--- Error output from package installation ---
grep: /lib/modules/3.5.0-1-generic/build/.config: No such file or directory

------
FAIL
test_virtualbox (__main__.TestUbuntuDrivers)
virtualbox-dkms ... 
--- Error output from package installation ---

Extracting templates from packages: 48%
Extracting templates from packages: 96%
Extracting templates from packages: 100%
invoke-rc.d: initscript virtualbox, action "restart" failed.
invoke-rc.d: initscript virtualbox, action "restart" failed.

------
FAIL

======================================================================
FAIL: test_fglrx (__main__.TestUbuntuDrivers)
fglrx
----------------------------------------------------------------------
Traceback (most recent call last):
  File "/tmp/tmp.zYKDcL5ALn/dsc0-build/ubuntu-drivers-common-0.2.58/debian/tests/system", line 90, in test_fglrx
    'fglrx', 'fglrx', auto_install=False)
  File "/tmp/tmp.zYKDcL5ALn/dsc0-build/ubuntu-drivers-common-0.2.58/debian/tests/system", line 133, in do_test_driver
    o = program_out_success(['modinfo', module], self)
  File "/tmp/tmp.zYKDcL5ALn/dsc0-build/ubuntu-drivers-common-0.2.58/debian/tests/system", line 25, in program_out_success
    self.assertEqual(err, '', err)
AssertionError: 'ERROR: modinfo: could not find module fglrx\n' != ''
- ERROR: modinfo: could not find module fglrx
 : ERROR: modinfo: could not find module fglrx


======================================================================
FAIL: test_fglrx_updates (__main__.TestUbuntuDrivers)
fglrx-updates
----------------------------------------------------------------------
Traceback (most recent call last):
  File "/tmp/tmp.zYKDcL5ALn/dsc0-build/ubuntu-drivers-common-0.2.58/debian/tests/system", line 96, in test_fglrx_updates
    'fglrx-updates', 'fglrx_updates', auto_install=False)
  File "/tmp/tmp.zYKDcL5ALn/dsc0-build/ubuntu-drivers-common-0.2.58/debian/tests/system", line 133, in do_test_driver
    o = program_out_success(['modinfo', module], self)
  File "/tmp/tmp.zYKDcL5ALn/dsc0-build/ubuntu-drivers-common-0.2.58/debian/tests/system", line 25, in program_out_success
    self.assertEqual(err, '', err)
AssertionError: 'ERROR: modinfo: could not find module fglrx_updates\n' != ''
- ERROR: modinfo: could not find module fglrx_updates
 : ERROR: modinfo: could not find module fglrx_updates


======================================================================
FAIL: test_nvidia_current (__main__.TestUbuntuDrivers)
nvidia-current
----------------------------------------------------------------------
Traceback (most recent call last):
  File "/tmp/tmp.zYKDcL5ALn/dsc0-build/ubuntu-drivers-common-0.2.58/debian/tests/system", line 77, in test_nvidia_current
    'nvidia-current', 'nvidia_current', auto_install=False)
  File "/tmp/tmp.zYKDcL5ALn/dsc0-build/ubuntu-drivers-common-0.2.58/debian/tests/system", line 114, in do_test_driver
    self.assertTrue(package + '\n' in o)
AssertionError: False is not true

======================================================================
FAIL: test_nvidia_current_updates (__main__.TestUbuntuDrivers)
nvidia-current-updates
----------------------------------------------------------------------
Traceback (most recent call last):
  File "/tmp/tmp.zYKDcL5ALn/dsc0-build/ubuntu-drivers-common-0.2.58/debian/tests/system", line 83, in test_nvidia_current_updates
    'nvidia-current-updates', 'nvidia_current_updates', auto_install=False)
  File "/tmp/tmp.zYKDcL5ALn/dsc0-build/ubuntu-drivers-common-0.2.58/debian/tests/system", line 114, in do_test_driver
    self.assertTrue(package + '\n' in o)
AssertionError: False is not true

======================================================================
FAIL: test_sl_modem (__main__.TestUbuntuDrivers)
sl-modem-dkms
----------------------------------------------------------------------
Traceback (most recent call last):
  File "/tmp/tmp.zYKDcL5ALn/dsc0-build/ubuntu-drivers-common-0.2.58/debian/tests/system", line 106, in test_sl_modem
    self.do_test_driver(None, 'sl-modem-dkms', 'slusb', auto_install=False)
  File "/tmp/tmp.zYKDcL5ALn/dsc0-build/ubuntu-drivers-common-0.2.58/debian/tests/system", line 133, in do_test_driver
    o = program_out_success(['modinfo', module], self)
  File "/tmp/tmp.zYKDcL5ALn/dsc0-build/ubuntu-drivers-common-0.2.58/debian/tests/system", line 25, in program_out_success
    self.assertEqual(err, '', err)
AssertionError: 'ERROR: modinfo: could not find module slusb\n' != ''
- ERROR: modinfo: could not find module slusb
 : ERROR: modinfo: could not find module slusb


======================================================================
FAIL: test_virtualbox (__main__.TestUbuntuDrivers)
virtualbox-dkms
----------------------------------------------------------------------
Traceback (most recent call last):
  File "/tmp/tmp.zYKDcL5ALn/dsc0-build/ubuntu-drivers-common-0.2.58/debian/tests/system", line 101, in test_virtualbox
    self.do_test_driver(None, 'virtualbox-dkms', 'vboxdrv', auto_install=False)
  File "/tmp/tmp.zYKDcL5ALn/dsc0-build/ubuntu-drivers-common-0.2.58/debian/tests/system", line 133, in do_test_driver
    o = program_out_success(['modinfo', module], self)
  File "/tmp/tmp.zYKDcL5ALn/dsc0-build/ubuntu-drivers-common-0.2.58/debian/tests/system", line 25, in program_out_success
    self.assertEqual(err, '', err)
AssertionError: 'ERROR: modinfo: could not find module vboxdrv\n' != ''
- ERROR: modinfo: could not find module vboxdrv
 : ERROR: modinfo: could not find module vboxdrv


----------------------------------------------------------------------
Ran 9 tests in 487.307s

FAILED (failures=6)
adt-run: trace: & dsc0t-system: ----------------------------------------]
adt-run: trace1: ** needs_reset, previously=False
adt-run: trace: @@@@@@@@@@@@@@@@@@@@@@@@@@@@@@@@@@@@@@@@ tests done.
adt-run: trace: ** stop
adt-run: trace: ** close, scratch=tb-scratch~/tmp/tmp.zYKDcL5ALn:-/|/tmp/tmp.zYKDcL5ALn/!
+ RET=4
+ [ 4 -gt 0 ]
+ log_failure_msg adt-run exited with status 4.
+ log_msg Failure: adt-run exited with status 4.\n
+ date +%F %X
+ printf 2012-06-29 08:18:04: Failure: adt-run exited with status 4.\n
2012-06-29 08:18:04: Failure: adt-run exited with status 4.
+ mkdir -p <http://10.189.74.2:8080/job/quantal-adt-ubuntu-drivers-common/./ARCH=amd64,label=albali/ws/results>
+ ssh -o UserKnownHostsFile=/dev/null -o StrictHostKeyChecking=no -o CheckHostIP=no -i /tmp/adt/disks/adtkey -p 54328 -t -o BatchMode=yes -l ubuntu localhost sudo chown -R ubuntu /home/ubuntu/adt-log
Pseudo-terminal will not be allocated because stdin is not a terminal.
Warning: Permanently added '[localhost]:54328' (ECDSA) to the list of known hosts.
sudo: unable to resolve host autopkgtest
+ scp -r -o UserKnownHostsFile=/dev/null -o StrictHostKeyChecking=no -o CheckHostIP=no -i /tmp/adt/disks/adtkey -P 54328 ubuntu at localhost:/home/ubuntu/adt-log/* <http://10.189.74.2:8080/job/quantal-adt-ubuntu-drivers-common/./ARCH=amd64,label=albali/ws/results>
Warning: Permanently added '[localhost]:54328' (ECDSA) to the list of known hosts.
+ scp -r -o UserKnownHostsFile=/dev/null -o StrictHostKeyChecking=no -o CheckHostIP=no -i /tmp/adt/disks/adtkey -P 54328 ubuntu at localhost:/var/crash/*crash <http://10.189.74.2:8080/job/quantal-adt-ubuntu-drivers-common/./ARCH=amd64,label=albali/ws/results>
Warning: Permanently added '[localhost]:54328' (ECDSA) to the list of known hosts.
scp: /var/crash/*crash: No such file or directory
+ true
+ ssh -o UserKnownHostsFile=/dev/null -o StrictHostKeyChecking=no -o CheckHostIP=no -i /tmp/adt/disks/adtkey -p 54328 -t -o BatchMode=yes -l ubuntu localhost sudo poweroff
Pseudo-terminal will not be allocated because stdin is not a terminal.
Warning: Permanently added '[localhost]:54328' (ECDSA) to the list of known hosts.
sudo: unable to resolve host autopkgtest
+ cat /dev/shm/adt/quantal-amd64-ubuntu-drivers-common-20120629_080551.img.pid
+ kill -9 68917
+ rm /dev/shm/adt/quantal-amd64-ubuntu-drivers-common-20120629_080551.img.pid
+ rm /dev/shm/adt/quantal-amd64-ubuntu-drivers-common-20120629_080551.img
+ rm -Rf /tmp/adt-amd64.U8fPSK
+ exit 4
Build step 'Execute shell' marked build as failure
Archiving artifacts



More information about the ubuntu-testing-notifications mailing list