[Bug 791243] Re: squeak-vm version 1: failed to build on armel

Bug Watch Updater 791243 at bugs.launchpad.net
Thu Feb 23 02:04:54 UTC 2012

** Changed in: squeak-vm (Debian)
       Status: New => Fix Committed

You received this bug notification because you are a member of Sugar
Team, which is subscribed to squeak-vm in Ubuntu.

  squeak-vm version 1: failed to build on armel

Status in “squeak-vm” package in Ubuntu:
  In Progress
Status in “squeak-vm” package in Debian:
  Fix Committed

Bug description:
  squeak-vm version 1: failed to build on armel
  Link to failed build: https://launchpad.net/ubuntu/+source/squeak-vm/1:

  Direct link to the build log: https://launchpad.net/ubuntu/+source

  This log snippet might be of interest, since it triggered the matcher 'Purging chroot-autobuild'.
  Excerpt 2473 lines into the build log:

  [  9%] Built target FloatArrayPlugin
  make[3]: Entering directory `/build/buildd/squeak-vm-'
  Scanning dependencies of target FloatMathPlugin
  make[3]: Leaving directory `/build/buildd/squeak-vm-'
  make[3]: Entering directory `/build/buildd/squeak-vm-'
  [ 10%] Building C object FloatMathPlugin/CMakeFiles/FloatMathPlugin.dir/build/buildd/squeak-vm-
  cc1: error: unrecognized command line option '-mno-fused-madd'
  make[3]: *** [FloatMathPlugin/CMakeFiles/FloatMathPlugin.dir/build/buildd/squeak-vm-] Error 1
  make[3]: Leaving directory `/build/buildd/squeak-vm-'
  make[2]: *** [FloatMathPlugin/CMakeFiles/FloatMathPlugin.dir/all] Error 2
  make[2]: Leaving directory `/build/buildd/squeak-vm-'
  make[1]: *** [all] Error 2
  make[1]: Leaving directory `/build/buildd/squeak-vm-'
  make: *** [build-stamp] Error 2
  dpkg-buildpackage: error: debian/rules build gave error exit status 2
  Build finished at 20110513-2052
  FAILED [dpkg-buildpackage died]
  Purging chroot-autobuild/build/buildd/squeak-vm-

To manage notifications about this bug go to:

More information about the Ubuntu-sugarteam mailing list