[Bug 791243] Re: squeak-vm version 1:4.4.7.2357-1 failed to build on armel

Bug Watch Updater 791243 at bugs.launchpad.net
Thu Aug 11 11:37:54 UTC 2011


** Changed in: squeak-vm (Debian)
       Status: Unknown => New

-- 
You received this bug notification because you are a member of Sugar
Team, which is subscribed to squeak-vm in Ubuntu.
https://bugs.launchpad.net/bugs/791243

Title:
  squeak-vm version 1:4.4.7.2357-1 failed to build on armel

Status in “squeak-vm” package in Ubuntu:
  In Progress
Status in “squeak-vm” package in Debian:
  New

Bug description:
  squeak-vm version 1:4.4.7.2357-1 failed to build on armel
  Link to failed build: https://launchpad.net/ubuntu/+source/squeak-vm/1:4.4.7.2357-1/+build/2493539

  Direct link to the build log: https://launchpad.net/ubuntu/+source
  /squeak-vm/1:4.4.7.2357-1/+build/2493539/+files/buildlog_ubuntu-
  oneiric-armel.squeak-vm_1%3A4.4.7.2357-1_FAILEDTOBUILD.txt.gz

  This log snippet might be of interest, since it triggered the matcher 'Purging chroot-autobuild'.
  Excerpt 2473 lines into the build log:

  [  9%] Built target FloatArrayPlugin
  make[3]: Entering directory `/build/buildd/squeak-vm-4.4.7.2357/build-tree'
  Scanning dependencies of target FloatMathPlugin
  make[3]: Leaving directory `/build/buildd/squeak-vm-4.4.7.2357/build-tree'
  make[3]: Entering directory `/build/buildd/squeak-vm-4.4.7.2357/build-tree'
  [ 10%] Building C object FloatMathPlugin/CMakeFiles/FloatMathPlugin.dir/build/buildd/squeak-vm-4.4.7.2357/unix/src/vm/intplugins/FloatMathPlugin/FloatMathPlugin.c.o
  cc1: error: unrecognized command line option '-mno-fused-madd'
  make[3]: *** [FloatMathPlugin/CMakeFiles/FloatMathPlugin.dir/build/buildd/squeak-vm-4.4.7.2357/unix/src/vm/intplugins/FloatMathPlugin/FloatMathPlugin.c.o] Error 1
  make[3]: Leaving directory `/build/buildd/squeak-vm-4.4.7.2357/build-tree'
  make[2]: *** [FloatMathPlugin/CMakeFiles/FloatMathPlugin.dir/all] Error 2
  make[2]: Leaving directory `/build/buildd/squeak-vm-4.4.7.2357/build-tree'
  make[1]: *** [all] Error 2
  make[1]: Leaving directory `/build/buildd/squeak-vm-4.4.7.2357/build-tree'
  make: *** [build-stamp] Error 2
  dpkg-buildpackage: error: debian/rules build gave error exit status 2
  ******************************************************************************
  Build finished at 20110513-2052
  FAILED [dpkg-buildpackage died]
  Purging chroot-autobuild/build/buildd/squeak-vm-4.4.7.2357

To manage notifications about this bug go to:
https://bugs.launchpad.net/ubuntu/+source/squeak-vm/+bug/791243/+subscriptions



More information about the Ubuntu-sugarteam mailing list