[Bug 293487] [NEW] package update-manager 1:0.93.32 failed to install/upgrade: ErrorMessage: SystemError in cache.commit(): E:Sub-process /usr/bin/dpkg returned an error code (1), E:Sub-process /usr/bin/dpkg returned an error code (1)

Launchpad Bug Tracker 293487 at bugs.launchpad.net
Tue Nov 4 07:55:35 GMT 2008


You have been subscribed to a public bug:

Binary package hint: update-manager

Errors were encountered while processing:
 ubuntustudio-menu
Traceback (most recent call last):
  File "/usr/lib/python2.5/logging/__init__.py", line 753, in emit
    self.flush()
  File "/usr/lib/python2.5/logging/__init__.py", line 731, in flush
    self.stream.flush()
IOError: [Errno 9] Bad file descriptor
Traceback (most recent call last):
  File "/usr/lib/python2.5/logging/__init__.py", line 753, in emit
    self.flush()
  File "/usr/lib/python2.5/logging/__init__.py", line 731, in flush
    self.stream.flush()
IOError: [Errno 9] Bad file descriptor
Traceback (most recent call last):
  File "/usr/lib/python2.5/logging/__init__.py", line 753, in emit
    self.flush()
  File "/usr/lib/python2.5/logging/__init__.py", line 731, in flush
    self.stream.flush()
IOError: [Errno 9] Bad file descriptor

ProblemType: Package
Architecture: amd64
DistroRelease: Ubuntu 8.10
ErrorMessage: ErrorMessage: SystemError in cache.commit(): E:Sub-process /usr/bin/dpkg returned an error code (1), E:Sub-process /usr/bin/dpkg returned an error code (1)

NonfreeKernelModules: nvidia
Package: update-manager 1:0.93.32
PackageArchitecture: all
SourcePackage: update-manager
Title: package update-manager 1:0.93.32 failed to install/upgrade: ErrorMessage: SystemError in cache.commit(): E:Sub-process /usr/bin/dpkg returned an error code (1), E:Sub-process /usr/bin/dpkg returned an error code (1)
Uname: Linux 2.6.24-21-generic x86_64

** Affects: ubuntustudio-menu (Ubuntu)
     Importance: Undecided
         Status: Confirmed


** Tags: apport-package
-- 
package update-manager 1:0.93.32 failed to install/upgrade: ErrorMessage: SystemError in cache.commit(): E:Sub-process /usr/bin/dpkg returned an error code (1), E:Sub-process /usr/bin/dpkg returned an error code (1)
https://bugs.edge.launchpad.net/bugs/293487
You received this bug notification because you are a member of Ubuntu Studio-dev, which is subscribed to ubuntustudio-menu in ubuntu.



More information about the Ubuntu-Studio-devel mailing list