[Bug 833013] Re: libjboss-remoting-java version 2.5.2.SP1-2 failed to build in oneiric

James Page james.page at ubuntu.com
Tue Sep 13 10:21:33 UTC 2011


** Branch unlinked: lp:~james-page/ubuntu/oneiric/libjboss-remoting-
java/ftbfs

-- 
You received this bug notification because you are a member of Ubuntu
Sponsors Team, which is subscribed to the bug report.
https://bugs.launchpad.net/bugs/833013

Title:
  libjboss-remoting-java version 2.5.2.SP1-2 failed to build in oneiric

Status in “libjboss-remoting-java” package in Ubuntu:
  In Progress
Status in “libjboss-remoting-java” source package in Oneiric:
  In Progress
Status in “libjboss-remoting-java” package in Debian:
  Fix Released

Bug description:
  libjboss-remoting-java version 2.5.2.SP1-2 failed to build in oneiric
  Link to failed build: https://launchpad.net/ubuntu/+archive/test-rebuild-20110816/+build/2701342

  Details about the rebuild:
  http://people.ubuntuwire.org/~wgrant/rebuild-ftbfs-test/test-rebuild-20110816-oneiric.html

  Direct link to the build log: https://launchpad.net/ubuntu/+archive
  /test-rebuild-20110816/+build/2701342/+files/buildlog_ubuntu-
  oneiric-i386.libjboss-remoting-java_2.5.2.SP1-2_FAILEDTOBUILD.txt.gz

  This log snippet might be of interest, since it triggered the matcher 'Purging chroot-autobuild'.
  Excerpt 1206 lines into the build log:

      [javac] CoyoteInvoker.java:82: org.jboss.remoting.transport.coyote.CoyoteInvoker is not abstract and does not override abstract method log(org.apache.coyote.Request,org.apache.coyote.Response,long) in org.apache.coyote.Adapter
      [javac] public class CoyoteInvoker extends WebServerInvoker implements Adapter
      [javac]        ^
      [javac] Note: Some input files use or override a deprecated API.
      [javac] Note: Recompile with -Xlint:deprecation for details.
      [javac] Note: Some input files use unchecked or unsafe operations.
      [javac] Note: Recompile with -Xlint:unchecked for details.
      [javac] 1 error

  BUILD FAILED
  /build/buildd/libjboss-remoting-java-2.5.2.SP1/debian/build.xml:13: Compile failed; see the compiler error output for details.

  Total time: 7 seconds
  make: *** [debian/stamp-ant-build] Error 1
  dpkg-buildpackage: error: debian/rules build gave error exit status 2
  ******************************************************************************
  Build finished at 20110824-1307
  FAILED [dpkg-buildpackage died]
  Purging chroot-autobuild/build/buildd/libjboss-remoting-java-2.5.2.SP1

To manage notifications about this bug go to:
https://bugs.launchpad.net/ubuntu/+source/libjboss-remoting-java/+bug/833013/+subscriptions



More information about the Ubuntu-sponsors mailing list