[Bug 1732609] [NEW] package openvswitch-testcontroller 2.5.2-0ubuntu0.16.04.3 failed to install/upgrade: subprocess installed post-installation script returned error exit status 1

azy dwi putra sentosa 1732609 at bugs.launchpad.net
Thu Nov 16 07:24:34 UTC 2017


Public bug reported:

openvswitch-testcontroller.service - LSB: Simple OpenFlow controller for testing
   Loaded: loaded (/etc/init.d/openvswitch-testcontroller; bad; vendor preset: enabled)
   Active: failed (Result: exit-code) since Kam 2017-11-16 14:18:59 WIB; 15ms ago
     Docs: man:systemd-sysv-generator(8)
  Process: 23906 ExecStart=/etc/init.d/openvswitch-testcontroller start (code=exited, status=1/FAILURE)

Nov 16 14:18:59 zyy-K46CB systemd[1]: Starting LSB: Simple OpenFlow control.....
Nov 16 14:18:59 zyy-K46CB openvswitch-testcontroller[23906]:  * Starting ovs-...
Nov 16 14:18:59 zyy-K46CB openvswitch-testcontroller[23906]: 2017-11-16T07:18...
Nov 16 14:18:59 zyy-K46CB openvswitch-testcontroller[23906]: 2017-11-16T07:18...
Nov 16 14:18:59 zyy-K46CB openvswitch-testcontroller[23906]: ovs-testcontroll...
Nov 16 14:18:59 zyy-K46CB systemd[1]: openvswitch-testcontroller.service: C...=1
Nov 16 14:18:59 zyy-K46CB openvswitch-testcontroller[23906]:    ...fail!
Nov 16 14:18:59 zyy-K46CB systemd[1]: Failed to start LSB: Simple OpenFlow ...g.
Nov 16 14:18:59 zyy-K46CB systemd[1]: openvswitch-testcontroller.service: U...e.
Nov 16 14:18:59 zyy-K46CB systemd[1]: openvswitch-testcontroller.service: F...'.
Hint: Some lines were ellipsized, use -l to show in full.
dpkg: error processing package openvswitch-testcontroller (--configure):
 subprocess installed post-installation script returned error exit status 1
Processing triggers for systemd (229-4ubuntu21) ...
Processing triggers for ureadahead (0.100.0-19) ...
Errors were encountered while processing:
 openvswitch-testcontroller
E: Sub-process /usr/bin/dpkg returned an error code (1)

ProblemType: Package
DistroRelease: Ubuntu 16.04
Package: openvswitch-testcontroller 2.5.2-0ubuntu0.16.04.3
ProcVersionSignature: Ubuntu 4.10.0-38.42~16.04.1-generic 4.10.17
Uname: Linux 4.10.0-38-generic i686
ApportVersion: 2.20.1-0ubuntu2.12
AptOrdering:
 openvswitch-pki: Install
 openvswitch-testcontroller: Install
 openvswitch-pki: Configure
 openvswitch-testcontroller: Configure
 NULL: ConfigurePending
Architecture: i386
Date: Thu Nov 16 14:18:59 2017
ErrorMessage: subprocess installed post-installation script returned error exit status 1
InstallationDate: Installed on 2017-11-15 (0 days ago)
InstallationMedia: Ubuntu 16.04.3 LTS "Xenial Xerus" - Release i386 (20170801)
RelatedPackageVersions:
 dpkg 1.18.4ubuntu1.2
 apt  1.2.24
SourcePackage: openvswitch
Title: package openvswitch-testcontroller 2.5.2-0ubuntu0.16.04.3 failed to install/upgrade: subprocess installed post-installation script returned error exit status 1
UpgradeStatus: No upgrade log present (probably fresh install)

** Affects: openvswitch (Ubuntu)
     Importance: Undecided
         Status: New


** Tags: apport-package i386 xenial

-- 
You received this bug notification because you are a member of Ubuntu
OpenStack, which is subscribed to openvswitch in Ubuntu.
https://bugs.launchpad.net/bugs/1732609

Title:
  package openvswitch-testcontroller 2.5.2-0ubuntu0.16.04.3 failed to
  install/upgrade: subprocess installed post-installation script
  returned error exit status 1

Status in openvswitch package in Ubuntu:
  New

Bug description:
  openvswitch-testcontroller.service - LSB: Simple OpenFlow controller for testing
     Loaded: loaded (/etc/init.d/openvswitch-testcontroller; bad; vendor preset: enabled)
     Active: failed (Result: exit-code) since Kam 2017-11-16 14:18:59 WIB; 15ms ago
       Docs: man:systemd-sysv-generator(8)
    Process: 23906 ExecStart=/etc/init.d/openvswitch-testcontroller start (code=exited, status=1/FAILURE)

  Nov 16 14:18:59 zyy-K46CB systemd[1]: Starting LSB: Simple OpenFlow control.....
  Nov 16 14:18:59 zyy-K46CB openvswitch-testcontroller[23906]:  * Starting ovs-...
  Nov 16 14:18:59 zyy-K46CB openvswitch-testcontroller[23906]: 2017-11-16T07:18...
  Nov 16 14:18:59 zyy-K46CB openvswitch-testcontroller[23906]: 2017-11-16T07:18...
  Nov 16 14:18:59 zyy-K46CB openvswitch-testcontroller[23906]: ovs-testcontroll...
  Nov 16 14:18:59 zyy-K46CB systemd[1]: openvswitch-testcontroller.service: C...=1
  Nov 16 14:18:59 zyy-K46CB openvswitch-testcontroller[23906]:    ...fail!
  Nov 16 14:18:59 zyy-K46CB systemd[1]: Failed to start LSB: Simple OpenFlow ...g.
  Nov 16 14:18:59 zyy-K46CB systemd[1]: openvswitch-testcontroller.service: U...e.
  Nov 16 14:18:59 zyy-K46CB systemd[1]: openvswitch-testcontroller.service: F...'.
  Hint: Some lines were ellipsized, use -l to show in full.
  dpkg: error processing package openvswitch-testcontroller (--configure):
   subprocess installed post-installation script returned error exit status 1
  Processing triggers for systemd (229-4ubuntu21) ...
  Processing triggers for ureadahead (0.100.0-19) ...
  Errors were encountered while processing:
   openvswitch-testcontroller
  E: Sub-process /usr/bin/dpkg returned an error code (1)

  ProblemType: Package
  DistroRelease: Ubuntu 16.04
  Package: openvswitch-testcontroller 2.5.2-0ubuntu0.16.04.3
  ProcVersionSignature: Ubuntu 4.10.0-38.42~16.04.1-generic 4.10.17
  Uname: Linux 4.10.0-38-generic i686
  ApportVersion: 2.20.1-0ubuntu2.12
  AptOrdering:
   openvswitch-pki: Install
   openvswitch-testcontroller: Install
   openvswitch-pki: Configure
   openvswitch-testcontroller: Configure
   NULL: ConfigurePending
  Architecture: i386
  Date: Thu Nov 16 14:18:59 2017
  ErrorMessage: subprocess installed post-installation script returned error exit status 1
  InstallationDate: Installed on 2017-11-15 (0 days ago)
  InstallationMedia: Ubuntu 16.04.3 LTS "Xenial Xerus" - Release i386 (20170801)
  RelatedPackageVersions:
   dpkg 1.18.4ubuntu1.2
   apt  1.2.24
  SourcePackage: openvswitch
  Title: package openvswitch-testcontroller 2.5.2-0ubuntu0.16.04.3 failed to install/upgrade: subprocess installed post-installation script returned error exit status 1
  UpgradeStatus: No upgrade log present (probably fresh install)

To manage notifications about this bug go to:
https://bugs.launchpad.net/ubuntu/+source/openvswitch/+bug/1732609/+subscriptions



More information about the Ubuntu-openstack-bugs mailing list