[Bug 1483572] sosreport-GerhardStenzel.140741-20160426174643.tar.xz

bugproxy bugproxy at us.ibm.com
Sat Feb 11 18:49:48 UTC 2017


Default Comment by Bridge

** Attachment added: "sosreport-GerhardStenzel.140741-20160426174643.tar.xz"
   https://bugs.launchpad.net/bugs/1483572/+attachment/4817067/+files/sosreport-GerhardStenzel.140741-20160426174643.tar.xz

-- 
You received this bug notification because you are a member of Ubuntu
OpenStack, which is subscribed to openvswitch in Ubuntu.
https://bugs.launchpad.net/bugs/1483572

Title:
  2.4.0: unit test failures on powerpc

Status in openvswitch package in Ubuntu:
  Incomplete

Bug description:
  https://launchpadlibrarian.net/214057212/buildlog_ubuntu-wily-
  powerpc.openvswitch_2.4.0~git20150810.97bab95-0ubuntu1_BUILDING.txt.gz

  ## ----------------------------- ##
  ## openvswitch 2.4.0 test suite. ##
  ## ----------------------------- ##

  tunnel_push_pop

  637: tunnel_push_pop - action                        FAILED (tunnel-
  push-pop.at:76)

  dpif-netdev

  779: dpif-netdev - dummy interface                   FAILED (dpif-netdev.at:47)
  780: dpif-netdev - miss upcall key matches flow_install FAILED (dpif-netdev.at:71)

  ofproto-dpif

  785: ofproto-dpif - active-backup bonding            FAILED (ofproto-dpif.at:45)
  803: ofproto-dpif - select group with hash selection method FAILED (ofproto-dpif.at:444)
  833: ofproto-dpif - MPLS handling                    FAILED (ofproto-dpif.at:1975)
  879: ofproto-dpif - MPLS actions that result in a userspace action FAILED (ofproto-dpif.at:5499)
  880: ofproto-dpif - MPLS actions that result in a drop FAILED (ofproto-dpif.at:5538)
  881: ofproto-dpif - patch ports                      FAILED (ofproto-dpif.at:5594)
  882: ofproto-dpif - patch ports - stack              FAILED (ofproto-dpif.at:5659)

  ofproto-dpif -- megaflows

  884: ofproto-dpif megaflow - port classification     FAILED (ofproto-dpif.at:5702)
  885: ofproto-dpif megaflow - L2 classification       FAILED (ofproto-dpif.at:5719)
  886: ofproto-dpif megaflow - L3 classification       FAILED (ofproto-dpif.at:5738)
  887: ofproto-dpif megaflow - IPv6 classification     FAILED (ofproto-dpif.at:5757)
  888: ofproto-dpif megaflow - L4 classification       FAILED (ofproto-dpif.at:5776)
  889: ofproto-dpif megaflow - normal                  FAILED (ofproto-dpif.at:5790)
  890: ofproto-dpif megaflow - mpls                    FAILED (ofproto-dpif.at:5809)
  891: ofproto-dpif megaflow - netflow - IPv4 collector FAILED (ofproto-dpif.at:5846)
  892: ofproto-dpif megaflow - netflow - IPv6 collector FAILED (ofproto-dpif.at:5847)
  893: ofproto-dpif megaflow - normal, active-backup bonding FAILED (ofproto-dpif.at:5863)
  894: ofproto-dpif megaflow - normal, balance-slb bonding FAILED (ofproto-dpif.at:5884)
  895: ofproto-dpif megaflow - normal, balance-tcp bonding FAILED (ofproto-dpif.at:5922)
  896: ofproto-dpif megaflow - resubmit port action    FAILED (ofproto-dpif.at:5941)
  897: ofproto-dpif megaflow - resubmit table action   FAILED (ofproto-dpif.at:5961)
  898: ofproto-dpif megaflow - goto_table action       FAILED (ofproto-dpif.at:5980)
  899: ofproto-dpif megaflow - mirroring, select_all   FAILED (ofproto-dpif.at:6004)
  900: ofproto-dpif megaflow - mirroring, select_vlan  FAILED (ofproto-dpif.at:6026)
  901: ofproto-dpif megaflow - move action             FAILED (ofproto-dpif.at:6046)
  902: ofproto-dpif megaflow - push action             FAILED (ofproto-dpif.at:6064)
  903: ofproto-dpif megaflow - learning                FAILED (ofproto-dpif.at:6091)
  904: ofproto-dpif megaflow - tunnels                 FAILED (ofproto-dpif.at:6123)
  905: ofproto-dpif megaflow - dec_ttl                 FAILED (ofproto-dpif.at:6143)
  906: ofproto-dpif megaflow - set dl_dst              FAILED (ofproto-dpif.at:6164)
  907: ofproto-dpif megaflow - disabled                FAILED (ofproto-dpif.at:6193)

  ofproto-dpif - flow translation resource limits

  922: ofproto-dpif - vlan matching                    FAILED (ofproto-
  dpif.at:6688)

  ## ------------- ##
  ## Test results. ##
  ## ------------- ##

  ERROR: All 35 tests were run,
  35 failed unexpectedly.

To manage notifications about this bug go to:
https://bugs.launchpad.net/ubuntu/+source/openvswitch/+bug/1483572/+subscriptions



More information about the Ubuntu-openstack-bugs mailing list