[Bug 208918] Re: package flashplugin-nonfree 9.0.115.0ubuntu4 failed to install/upgrade: subprocess post-installation script returned error exit status 2

Dakkar dakkar9999 at gmail.com
Thu Dec 4 21:55:54 UTC 2008


Hey! No problem!  Thanks for replying!
On Thu, Dec 4, 2008 at 4:41 PM, David <cougarcia at hotmail.com> wrote:

>
> Hi,
> Sorry for the late reply. To be honest I don't remember very well how I
> solve it (it's been a while now), I think I downloaded the flash plug in
> from the Adobe website. Sorry I can give you "in depth" details for the
> instalation, but as far as I can remember it wasn't difficult (I'm a novice
> with Linux but I was able to do it fairly easy).
> Hope this was useful.> From: dakkar9999 at gmail.com> To:
> cougarcia at hotmail.com> Date: Mon, 1 Dec 2008 13:53:02 +0000> Subject: [Bug
> 208918] Re: package flashplugin-nonfree 9.0.115.0ubuntu4 failed to
> install/upgrade: subprocess post-installation script returned error exit
> status 2> > I seem to have the same problem with corrupt
> flashplugin-nonfree. I> also get the error code (1)> > > How did you solve
> it? Maybe a little more detail?> > Thanks!> > -- > package
> flashplugin-nonfree 9.0.115.0ubuntu4 failed to install/upgrade: subprocess
> post-installation script returned error exit status 2>
> https://bugs.launchpad.net/bugs/208918> You received this bug notification
> because you are a direct subscriber> of the bug.
> _________________________________________________________________
> Discover the new Windows Vista
> http://search.msn.com/results.aspx?q=windows+vista&mkt=en-US&form=QBRE
>
> --
> package flashplugin-nonfree 9.0.115.0ubuntu4 failed to install/upgrade:
> subprocess post-installation script returned error exit status 2
> https://bugs.launchpad.net/bugs/208918
> You received this bug notification because you are a direct subscriber
> of the bug.
>
> Status in "flashplugin-nonfree" source package in Ubuntu: Invalid
>
> Bug description:
> Binary package hint: flashplugin-nonfree
>
> I can't remove/install flashplugin-nonfree. First it complains about a
> missing directory, then after that I get a mysterious error:
>
> evan at thinkpad ~ $ sudo apt-get upgrade
> [sudo] password for evan:
> Reading package lists... Done
> Building dependency tree
> Reading state information... Done
> 0 upgraded, 0 newly installed, 0 to remove and 0 not upgraded.
> 1 not fully installed or removed.
> After this operation, 0B of additional disk space will be used.
> Do you want to continue [Y/n]? y
> Setting up flashplugin-nonfree (9.0.115.0ubuntu4) ...
> cd: 135: can't cd to /var/cache/flashplugin-nonfree
> dpkg: error processing flashplugin-nonfree (--configure):
>  subprocess post-installation script returned error exit status 2
> Errors were encountered while processing:
>  flashplugin-nonfree
> E: Sub-process /usr/bin/dpkg returned an error code (1)
> evan at thinkpad ~ $ sudo mkdir -p /var/cache/flashplugin-nonfree
> evan at thinkpad ~ $ sudo apt-get upgrade
> Reading package lists... Done
> Building dependency tree
> Reading state information... Done
> 0 upgraded, 0 newly installed, 0 to remove and 0 not upgraded.
> 1 not fully installed or removed.
> After this operation, 0B of additional disk space will be used.
> Do you want to continue [Y/n]? y
> Setting up flashplugin-nonfree (9.0.115.0ubuntu4) ...
> Downloading...
> --12:23:43--
> http://fpdownload.macromedia.com/get/flashplayer/current/install_flash_player_9_linux.tar.gz
>           => `./install_flash_player_9_linux.tar.gz'
> Resolving fpdownload.macromedia.com... 72.246.170.70
> Connecting to fpdownload.macromedia.com|72.246.170.70|:80... connected.
> HTTP request sent, awaiting response... 200 OK
> Length: 3,036,127 (2.9M) [application/x-gzip]
>
>    0K .......... .......... .......... .......... ..........  1%  318.24
> KB/s
>   50K .......... .......... .......... .......... ..........  3%  305.43
> KB/s
>  100K .......... .......... .......... .......... ..........  5%  317.17
> KB/s
>  150K .......... .......... .......... .......... ..........  6%  305.50
> KB/s
>  200K .......... .......... .......... .......... ..........  8%  316.63
> KB/s
>  250K .......... .......... .......... .......... .......... 10%  305.97
> KB/s
>  300K .......... .......... .......... .......... .......... 11%  309.28
> KB/s
>  350K .......... .......... .......... .......... .......... 13%  309.79
> KB/s
>  400K .......... .......... .......... .......... .......... 15%  301.82
> KB/s
>  450K .......... .......... .......... .......... .......... 16%  309.26
> KB/s
>  500K .......... .......... .......... .......... .......... 18%  309.30
> KB/s
>  550K .......... .......... .......... .......... .......... 20%  309.27
> KB/s
>  600K .......... .......... .......... .......... .......... 21%  313.17
> KB/s
>  650K .......... .......... .......... .......... .......... 23%  298.67
> KB/s
>  700K .......... .......... .......... .......... .......... 25%  313.13
> KB/s
>  750K .......... .......... .......... .......... .......... 26%  308.83
> KB/s
>  800K .......... .......... .......... .......... .......... 28%  309.75
> KB/s
>  850K .......... .......... .......... .......... .......... 30%  312.19
> KB/s
>  900K .......... .......... .......... .......... .......... 32%  302.74
> KB/s
>  950K .......... .......... .......... .......... .......... 33%  309.74
> KB/s
>  1000K .......... .......... .......... .......... .......... 35%  312.68
> KB/s
>  1050K .......... .......... .......... .......... .......... 37%  305.96
> KB/s
>  1100K .......... .......... .......... .......... .......... 38%  313.19
> KB/s
>  1150K .......... .......... .......... .......... .......... 40%  301.82
> KB/s
>  1200K .......... .......... .......... .......... .......... 42%  313.14
> KB/s
>  1250K .......... .......... .......... .......... .......... 43%  309.29
> KB/s
>  1300K .......... .......... .......... .......... .......... 45%  309.24
> KB/s
>  1350K .......... .......... .......... .......... .......... 47%  309.33
> KB/s
>  1400K .......... .......... .......... .......... .......... 48%  301.84
> KB/s
>  1450K .......... .......... .......... .......... .......... 50%  313.60
> KB/s
>  1500K .......... .......... .......... .......... .......... 52%  309.33
> KB/s
>  1550K .......... .......... .......... .......... .......... 53%  313.14
> KB/s
>  1600K .......... .......... .......... .......... .......... 55%  309.30
> KB/s
>  1650K .......... .......... .......... .......... .......... 57%  301.37
> KB/s
>  1700K .......... .......... .......... .......... .......... 59%  309.74
> KB/s
>  1750K .......... .......... .......... .......... .......... 60%  313.18
> KB/s
>  1800K .......... .......... .......... .......... .......... 62%  309.76
> KB/s
>  1850K .......... .......... .......... .......... .......... 64%  301.81
> KB/s
>  1900K .......... .......... .......... .......... .......... 65%  308.36
> KB/s
>  1950K .......... .......... .......... .......... .......... 67%  314.11
> KB/s
>  2000K .......... .......... .......... .......... .......... 69%  309.30
> KB/s
>  2050K .......... .......... .......... .......... .......... 70%  309.26
> KB/s
>  2100K .......... .......... .......... .......... .......... 72%  309.29
> KB/s
>  2150K .......... .......... .......... .......... .......... 74%  305.95
> KB/s
>  2200K .......... .......... .......... .......... .......... 75%  309.31
> KB/s
>  2250K .......... .......... .......... .......... .......... 77%  309.30
> KB/s
>  2300K .......... .......... .......... .......... .......... 79%  309.26
> KB/s
>  2350K .......... .......... .......... .......... .......... 80%  305.48
> KB/s
>  2400K .......... .......... .......... .......... .......... 82%  309.34
> KB/s
>  2450K .......... .......... .......... .......... .......... 84%  309.28
> KB/s
>  2500K .......... .......... .......... .......... .......... 86%  309.74
> KB/s
>  2550K .......... .......... .......... .......... .......... 87%  313.16
> KB/s
>  2600K .......... .......... .......... .......... .......... 89%  301.82
> KB/s
>  2650K .......... .......... .......... .......... .......... 91%  308.82
> KB/s
>  2700K .......... .......... .......... .......... .......... 92%  309.75
> KB/s
>  2750K .......... .......... .......... .......... .......... 94%  313.17
> KB/s
>  2800K .......... .......... .......... .......... .......... 96%  309.27
> KB/s
>  2850K .......... .......... .......... .......... .......... 97%  302.28
> KB/s
>  2900K .......... .......... .......... .......... .......... 99%  309.30
> KB/s
>  2950K .......... ....                                       100%  330.88
> KB/s
>
> 12:23:53 (309.02 KB/s) - `./install_flash_player_9_linux.tar.gz' saved
> [3036127/3036127]
>
> Download done.
> Flash Plugin installed.
> update-alternatives: error or eof reading
> /var/lib/dpkg/alternatives/iceape-flashplugin for update_mode ()
> dpkg: error processing flashplugin-nonfree (--configure):
>  subprocess post-installation script returned error exit status 2
> Errors were encountered while processing:
>  flashplugin-nonfree
> E: Sub-process /usr/bin/dpkg returned an error code (1)
>
> ProblemType: Package
> Architecture: i386
> Date: Sun Mar 23 21:30:37 2008
> DistroRelease: Ubuntu 8.04
> ErrorMessage: subprocess post-installation script returned error exit
> status 2
> Package: flashplugin-nonfree 9.0.115.0ubuntu4
> PackageArchitecture: i386
> SourcePackage: flashplugin-nonfree
> Title: package flashplugin-nonfree 9.0.115.0ubuntu4 failed to
> install/upgrade: subprocess post-installation script returned error exit
> status 2
> Uname: Linux 2.6.24-12-generic i686
>

-- 
package flashplugin-nonfree 9.0.115.0ubuntu4 failed to install/upgrade: subprocess post-installation script returned error exit status 2
https://bugs.launchpad.net/bugs/208918
You received this bug notification because you are a member of Mozilla
Bugs, which is subscribed to flashplugin-nonfree in ubuntu.




More information about the Ubuntu-mozillateam-bugs mailing list