[ubuntu-mono] [Bug 834994] Re: monodevelop-boo version 2.4-2 failed to build in oneiric
Matthias Klose
doko at ubuntu.com
Tue Aug 30 14:13:39 UTC 2011
package removed in oneiric, see bug #803978
** Changed in: monodevelop-boo (Ubuntu Oneiric)
Status: Confirmed => Fix Released
--
You received this bug notification because you are a member of Ubuntu
CLI/Mono Uploaders, which is subscribed to monodevelop-boo in Ubuntu.
https://bugs.launchpad.net/bugs/834994
Title:
monodevelop-boo version 2.4-2 failed to build in oneiric
Status in “monodevelop-boo” package in Ubuntu:
Fix Released
Status in “monodevelop-boo” source package in Oneiric:
Fix Released
Bug description:
monodevelop-boo version 2.4-2 failed to build in oneiric
Link to failed build: https://launchpad.net/ubuntu/+archive/test-rebuild-20110816/+build/2705470
Details about the rebuild:
http://people.ubuntuwire.org/~wgrant/rebuild-ftbfs-test/test-rebuild-20110816-oneiric.html
Direct link to the build log: https://launchpad.net/ubuntu/+archive
/test-rebuild-20110816/+build/2705470/+files/buildlog_ubuntu-
oneiric-i386.monodevelop-boo_2.4-2_FAILEDTOBUILD.txt.gz
This log snippet might be of interest, since it triggered the matcher 'Purging chroot-autobuild'.
Excerpt 2167 lines into the build log:
make DEBUG_BeforeBuild
make[3]: Entering directory `/build/buildd/monodevelop-boo-2.4/BooShell'
make[3]: Leaving directory `/build/buildd/monodevelop-boo-2.4/BooShell'
PKG_CONFIG_PATH=../../../local-config:$PKG_CONFIG_PATH booc -debug -out:../build/BooShell.dll -target:library './BooShell.boo' -pkg:monodevelop -pkg:glib-sharp-2.0 -pkg:gtk-sharp-2.0
Boo Compiler version 0.9.5.1 (2.10.4 (Debian 2.10.4-3))
./BooShell.boo(33,76): BCE0007: The name 'Print' does not represent a writable public property or field of the type 'Boo.Lang.Interpreter.InteractiveInterpreter'.
./BooShell.boo(110,38): BCE0019: 'LoopEval' is not a member of 'Boo.Lang.Interpreter.InteractiveInterpreter'.
./BooShell.boo(130,34): BCE0019: 'load' is not a member of 'Boo.Lang.Interpreter.InteractiveInterpreter'.
3 error(s).
make[2]: *** [../build/BooShell.dll] Error 127
make[2]: Leaving directory `/build/buildd/monodevelop-boo-2.4/BooShell'
make[1]: *** [all-recursive] Error 1
make[1]: Leaving directory `/build/buildd/monodevelop-boo-2.4'
make: *** [build-stamp] Error 2
dpkg-buildpackage: error: debian/rules build gave error exit status 2
******************************************************************************
Build finished at 20110826-1005
FAILED [dpkg-buildpackage died]
Purging chroot-autobuild/build/buildd/monodevelop-boo-2.4
To manage notifications about this bug go to:
https://bugs.launchpad.net/ubuntu/+source/monodevelop-boo/+bug/834994/+subscriptions
More information about the Ubuntu-mono
mailing list