[ubuntu-mono] [Bug 829435] Re: nunit version 2.5.10.11092+dfsg-1 failed to build in oneiric
Andrew Mitchell
ajmitch at ihug.co.nz
Thu Aug 25 11:18:43 UTC 2011
This was fixed by a patch to mono in 2.10.4-3 & tested in a local
pbuilder environment
** Changed in: nunit (Ubuntu Oneiric)
Status: Confirmed => Fix Released
--
You received this bug notification because you are a member of Ubuntu
CLI/Mono Uploaders, which is subscribed to nunit in Ubuntu.
https://bugs.launchpad.net/bugs/829435
Title:
nunit version 2.5.10.11092+dfsg-1 failed to build in oneiric
Status in “nunit” package in Ubuntu:
Fix Released
Status in “nunit” source package in Oneiric:
Fix Released
Bug description:
nunit version 2.5.10.11092+dfsg-1 failed to build in oneiric
Link to failed build: https://launchpad.net/ubuntu/+archive/test-rebuild-20110816/+build/2706515
Details about the rebuild:
http://people.ubuntuwire.org/~wgrant/rebuild-ftbfs-test/test-rebuild-20110816-oneiric.html
Direct link to the build log: https://launchpad.net/ubuntu/+archive
/test-rebuild-20110816/+build/2706515/+files/buildlog_ubuntu-
oneiric-i386.nunit_2.5.10.11092%2Bdfsg-1_FAILEDTOBUILD.txt.gz
This log snippet might be of interest, since it triggered the matcher 'Purging chroot-autobuild'.
Excerpt 1609 lines into the build log:
/build/buildd/nunit-2.5.10.11092+dfsg/src/NUnitCore/core/nunit.core.dll.csproj (default targets) ->
/usr/lib/mono/2.0/Microsoft.Common.targets (ResolveProjectReferences target) ->
/build/buildd/nunit-2.5.10.11092+dfsg/src/NUnitCore/interfaces/nunit.core.interfaces.dll.csproj (default targets) ->
/usr/lib/mono/2.0/Microsoft.CSharp.targets (CoreCompile target) ->
/usr/lib/mono/2.0/Microsoft.CSharp.targets: error : Error
executing tool '/usr/bin/gmcs': ApplicationName='/usr/bin/gmcs',
CommandLine='/noconfig @/tmp/tmp39cdc0be.tmp',
CurrentDirectory='/build/buildd/nunit-2.5.10.11092+dfsg/src/NUnitCore/interfaces'
0 Warning(s)
1 Error(s)
Time Elapsed 00:00:00.4525320
make[1]: *** [override_dh_auto_build] Error 1
make[1]: Leaving directory `/build/buildd/nunit-2.5.10.11092+dfsg'
make: *** [build] Error 2
dpkg-buildpackage: error: debian/rules build gave error exit status 2
******************************************************************************
Build finished at 20110818-1216
FAILED [dpkg-buildpackage died]
Purging chroot-autobuild/build/buildd/nunit-2.5.10.11092+dfsg
To manage notifications about this bug go to:
https://bugs.launchpad.net/ubuntu/+source/nunit/+bug/829435/+subscriptions
More information about the Ubuntu-mono
mailing list