install webcam imprimante carte video ......

pascal bonninmaps at neuf.fr
Ven 6 Nov 22:20:19 GMT 2009


voila  c que je trouve 


pascal at ubuntu:~$ cd bureau :vl4
bash: cd: bureau: Aucun fichier ou dossier de ce type
pascal at ubuntu:~$ cd bureau/vl4
bash: cd: bureau/vl4: Aucun fichier ou dossier de ce type
pascal at ubuntu:~$ cd bureau /vl4
bash: cd: bureau: Aucun fichier ou dossier de ce type
pascal at ubuntu:~$ cd Bureau/vl4
pascal at ubuntu:~/Bureau/vl4$ sudo make
[sudo] password for pascal: 
make -C /home/pascal/Bureau/vl4/v4l 
make[1]: entrant dans le répertoire « /home/pascal/Bureau/vl4/v4l »
creating symbolic links...
make -C firmware prep
make[2]: Entering directory `/home/pascal/Bureau/vl4/v4l/firmware'
make[2]: Leaving directory `/home/pascal/Bureau/vl4/v4l/firmware'
make -C firmware
make[2]: Entering directory `/home/pascal/Bureau/vl4/v4l/firmware'
make[2]: Nothing to be done for `default'.
make[2]: Leaving directory `/home/pascal/Bureau/vl4/v4l/firmware'
Kernel build directory is /lib/modules/2.6.31-14-generic/build
make -C /lib/modules/2.6.31-14-generic/build
SUBDIRS=/home/pascal/Bureau/vl4/v4l  modules
make[2]: Entering directory `/usr/src/linux-headers-2.6.31-14-generic'
  CC [M]  /home/pascal/Bureau/vl4/v4l/firedtv-1394.o
/home/pascal/Bureau/vl4/v4l/firedtv-1394.c:21:17: error: dma.h: No such
file or directory
/home/pascal/Bureau/vl4/v4l/firedtv-1394.c:22:21: error: csr1212.h: No
such file or directory
/home/pascal/Bureau/vl4/v4l/firedtv-1394.c:23:23: error: highlevel.h: No
such file or directory
/home/pascal/Bureau/vl4/v4l/firedtv-1394.c:24:19: error: hosts.h: No
such file or directory
/home/pascal/Bureau/vl4/v4l/firedtv-1394.c:25:22: error: ieee1394.h: No
such file or directory
/home/pascal/Bureau/vl4/v4l/firedtv-1394.c:26:17: error: iso.h: No such
file or directory
/home/pascal/Bureau/vl4/v4l/firedtv-1394.c:27:21: error: nodemgr.h: No
such file or directory
/home/pascal/Bureau/vl4/v4l/firedtv-1394.c:37: warning: 'struct
hpsb_iso' declared inside parameter list
/home/pascal/Bureau/vl4/v4l/firedtv-1394.c:37: warning: its scope is
only this definition or declaration, which is probably not what you want
/home/pascal/Bureau/vl4/v4l/firedtv-1394.c: In function
'rawiso_activity_cb':
/home/pascal/Bureau/vl4/v4l/firedtv-1394.c:53: error: dereferencing
pointer to incomplete type
/home/pascal/Bureau/vl4/v4l/firedtv-1394.c:54: error: implicit
declaration of function 'hpsb_iso_n_ready'
/home/pascal/Bureau/vl4/v4l/firedtv-1394.c:61: error: dereferencing
pointer to incomplete type
/home/pascal/Bureau/vl4/v4l/firedtv-1394.c:62: error: implicit
declaration of function 'dma_region_i'
/home/pascal/Bureau/vl4/v4l/firedtv-1394.c:62: error: dereferencing
pointer to incomplete type
/home/pascal/Bureau/vl4/v4l/firedtv-1394.c:62: error: expected
expression before 'unsigned'
/home/pascal/Bureau/vl4/v4l/firedtv-1394.c:63: warning: assignment makes
pointer from integer without a cast
/home/pascal/Bureau/vl4/v4l/firedtv-1394.c:64: error: dereferencing
pointer to incomplete type
/home/pascal/Bureau/vl4/v4l/firedtv-1394.c:68: error: dereferencing
pointer to incomplete type
/home/pascal/Bureau/vl4/v4l/firedtv-1394.c:82: error: implicit
declaration of function 'hpsb_iso_recv_release_packets'
/home/pascal/Bureau/vl4/v4l/firedtv-1394.c: In function 'node_of':
/home/pascal/Bureau/vl4/v4l/firedtv-1394.c:87: error: dereferencing
pointer to incomplete type
/home/pascal/Bureau/vl4/v4l/firedtv-1394.c:87: warning: type defaults to
'int' in declaration of '__mptr'
/home/pascal/Bureau/vl4/v4l/firedtv-1394.c:87: warning: initialization
from incompatible pointer type
/home/pascal/Bureau/vl4/v4l/firedtv-1394.c:87: error: invalid use of
undefined type 'struct unit_directory'
/home/pascal/Bureau/vl4/v4l/firedtv-1394.c: In function 'node_lock':
/home/pascal/Bureau/vl4/v4l/firedtv-1394.c:92: error: implicit
declaration of function 'hpsb_node_lock'
/home/pascal/Bureau/vl4/v4l/firedtv-1394.c:92: error:
'EXTCODE_COMPARE_SWAP' undeclared (first use in this function)
/home/pascal/Bureau/vl4/v4l/firedtv-1394.c:92: error: (Each undeclared
identifier is reported only once
/home/pascal/Bureau/vl4/v4l/firedtv-1394.c:92: error: for each function
it appears in.)
/home/pascal/Bureau/vl4/v4l/firedtv-1394.c:93: error: 'quadlet_t'
undeclared (first use in this function)
/home/pascal/Bureau/vl4/v4l/firedtv-1394.c:93: error: expected ')'
before 'arg'
/home/pascal/Bureau/vl4/v4l/firedtv-1394.c: In function 'node_read':
/home/pascal/Bureau/vl4/v4l/firedtv-1394.c:98: error: implicit
declaration of function 'hpsb_node_read'
/home/pascal/Bureau/vl4/v4l/firedtv-1394.c: In function 'node_write':
/home/pascal/Bureau/vl4/v4l/firedtv-1394.c:103: error: implicit
declaration of function 'hpsb_node_write'
/home/pascal/Bureau/vl4/v4l/firedtv-1394.c: In function 'start_iso':
/home/pascal/Bureau/vl4/v4l/firedtv-1394.c:114: error: implicit
declaration of function 'hpsb_iso_recv_init'
/home/pascal/Bureau/vl4/v4l/firedtv-1394.c:114: error: dereferencing
pointer to incomplete type
/home/pascal/Bureau/vl4/v4l/firedtv-1394.c:116: error:
'HPSB_ISO_DMA_DEFAULT' undeclared (first use in this function)
/home/pascal/Bureau/vl4/v4l/firedtv-1394.c:118: warning: assignment
makes pointer from integer without a cast
/home/pascal/Bureau/vl4/v4l/firedtv-1394.c:125: error: implicit
declaration of function 'hpsb_iso_recv_start'
/home/pascal/Bureau/vl4/v4l/firedtv-1394.c:128: error: implicit
declaration of function 'hpsb_iso_shutdown'
/home/pascal/Bureau/vl4/v4l/firedtv-1394.c: In function 'stop_iso':
/home/pascal/Bureau/vl4/v4l/firedtv-1394.c:139: error: implicit
declaration of function 'hpsb_iso_stop'
/home/pascal/Bureau/vl4/v4l/firedtv-1394.c: At top level:
/home/pascal/Bureau/vl4/v4l/firedtv-1394.c:154: warning: 'struct
hpsb_host' declared inside parameter list
/home/pascal/Bureau/vl4/v4l/firedtv-1394.c: In function 'fcp_request':
/home/pascal/Bureau/vl4/v4l/firedtv-1394.c:167: error: dereferencing
pointer to incomplete type
/home/pascal/Bureau/vl4/v4l/firedtv-1394.c:168: error: dereferencing
pointer to incomplete type
/home/pascal/Bureau/vl4/v4l/firedtv-1394.c: In function 'node_probe':
/home/pascal/Bureau/vl4/v4l/firedtv-1394.c:182: error: dereferencing
pointer to incomplete type
/home/pascal/Bureau/vl4/v4l/firedtv-1394.c:182: warning: type defaults
to 'int' in declaration of '__mptr'
/home/pascal/Bureau/vl4/v4l/firedtv-1394.c:182: warning: initialization
from incompatible pointer type
/home/pascal/Bureau/vl4/v4l/firedtv-1394.c:182: error: invalid use of
undefined type 'struct unit_directory'
/home/pascal/Bureau/vl4/v4l/firedtv-1394.c:187: error: dereferencing
pointer to incomplete type
/home/pascal/Bureau/vl4/v4l/firedtv-1394.c:187: error: 'quadlet_t'
undeclared (first use in this function)
/home/pascal/Bureau/vl4/v4l/firedtv-1394.c:188: error: implicit
declaration of function 'CSR1212_TEXTUAL_DESCRIPTOR_LEAF_DATA'
/home/pascal/Bureau/vl4/v4l/firedtv-1394.c:188: error: dereferencing
pointer to incomplete type
/home/pascal/Bureau/vl4/v4l/firedtv-1394.c:188: warning: assignment
makes pointer from integer without a cast
/home/pascal/Bureau/vl4/v4l/firedtv-1394.c: At top level:
/home/pascal/Bureau/vl4/v4l/firedtv-1394.c:243: warning: 'struct
unit_directory' declared inside parameter list
/home/pascal/Bureau/vl4/v4l/firedtv-1394.c: In function 'node_update':
/home/pascal/Bureau/vl4/v4l/firedtv-1394.c:245: error: dereferencing
pointer to incomplete type
/home/pascal/Bureau/vl4/v4l/firedtv-1394.c: At top level:
/home/pascal/Bureau/vl4/v4l/firedtv-1394.c:253: error: variable
'fdtv_driver' has initializer but incomplete type
/home/pascal/Bureau/vl4/v4l/firedtv-1394.c:254: error: unknown field
'name' specified in initializer
/home/pascal/Bureau/vl4/v4l/firedtv-1394.c:254: warning: excess elements
in struct initializer
/home/pascal/Bureau/vl4/v4l/firedtv-1394.c:254: warning: (near
initialization for 'fdtv_driver')
/home/pascal/Bureau/vl4/v4l/firedtv-1394.c:255: error: unknown field
'update' specified in initializer
/home/pascal/Bureau/vl4/v4l/firedtv-1394.c:255: warning: excess elements
in struct initializer
/home/pascal/Bureau/vl4/v4l/firedtv-1394.c:255: warning: (near
initialization for 'fdtv_driver')
/home/pascal/Bureau/vl4/v4l/firedtv-1394.c:256: error: unknown field
'driver' specified in initializer
/home/pascal/Bureau/vl4/v4l/firedtv-1394.c:256: error: extra brace group
at end of initializer
/home/pascal/Bureau/vl4/v4l/firedtv-1394.c:256: error: (near
initialization for 'fdtv_driver')
/home/pascal/Bureau/vl4/v4l/firedtv-1394.c:259: warning: excess elements
in struct initializer
/home/pascal/Bureau/vl4/v4l/firedtv-1394.c:259: warning: (near
initialization for 'fdtv_driver')
/home/pascal/Bureau/vl4/v4l/firedtv-1394.c:262: error: variable
'fdtv_highlevel' has initializer but incomplete type
/home/pascal/Bureau/vl4/v4l/firedtv-1394.c:263: error: unknown field
'name' specified in initializer
/home/pascal/Bureau/vl4/v4l/firedtv-1394.c:263: warning: excess elements
in struct initializer
/home/pascal/Bureau/vl4/v4l/firedtv-1394.c:263: warning: (near
initialization for 'fdtv_highlevel')
/home/pascal/Bureau/vl4/v4l/firedtv-1394.c:264: error: unknown field
'fcp_request' specified in initializer
/home/pascal/Bureau/vl4/v4l/firedtv-1394.c:264: warning: excess elements
in struct initializer
/home/pascal/Bureau/vl4/v4l/firedtv-1394.c:264: warning: (near
initialization for 'fdtv_highlevel')
/home/pascal/Bureau/vl4/v4l/firedtv-1394.c: In function
'fdtv_1394_init':
/home/pascal/Bureau/vl4/v4l/firedtv-1394.c:271: error: implicit
declaration of function 'hpsb_register_highlevel'
/home/pascal/Bureau/vl4/v4l/firedtv-1394.c:272: error: invalid use of
undefined type 'struct hpsb_protocol_driver'
/home/pascal/Bureau/vl4/v4l/firedtv-1394.c:273: error: implicit
declaration of function 'hpsb_register_protocol'
/home/pascal/Bureau/vl4/v4l/firedtv-1394.c:276: error: implicit
declaration of function 'hpsb_unregister_highlevel'
/home/pascal/Bureau/vl4/v4l/firedtv-1394.c: In function
'fdtv_1394_exit':
/home/pascal/Bureau/vl4/v4l/firedtv-1394.c:283: error: implicit
declaration of function 'hpsb_unregister_protocol'
make[3]: *** [/home/pascal/Bureau/vl4/v4l/firedtv-1394.o] Error 1
make[2]: *** [_module_/home/pascal/Bureau/vl4/v4l] Error 2
make[2]: Leaving directory `/usr/src/linux-headers-2.6.31-14-generic'
make[1]: *** [default] Erreur 2
make[1]: quittant le répertoire « /home/pascal/Bureau/vl4/v4l »
make: *** [all] Erreur 2
pascal at ubuntu:~/Bureau/vl4$ sudo make install
make -C /home/pascal/Bureau/vl4/v4l install
make[1]: entrant dans le répertoire « /home/pascal/Bureau/vl4/v4l »
-e 
Removing obsolete files
from /lib/modules/2.6.31-14-generic/kernel/drivers/media/video:

-e 
Removing obsolete files
from /lib/modules/2.6.31-14-generic/kernel/drivers/media/dvb/cinergyT2:

-e 
Removing obsolete files
from /lib/modules/2.6.31-14-generic/kernel/drivers/media/dvb/frontends:

Installing kernel modules
under /lib/modules/2.6.31-14-generic/kernel/drivers/media/:
/sbin/depmod -a 2.6.31-14-generic 
make -C firmware install
make[2]: Entering directory `/home/pascal/Bureau/vl4/v4l/firmware'
Installing firmwares at /lib/firmware: vicam/firmware.fw
dabusb/firmware.fw dabusb/bitstream.bin ttusb-budget/dspbootcode.bin
cpia2/stv0672_vp4.bin av7110/bootcode.bin 
make[2]: Leaving directory `/home/pascal/Bureau/vl4/v4l/firmware'
make[1]: quittant le répertoire « /home/pascal/Bureau/vl4/v4l »
pascal at ubuntu:~/Bureau/vl4$ 

la je comprend plus 
pas mal d'erreur
 pascal





Le vendredi 06 novembre 2009 à 10:48 -0500, Steve Nadeau a écrit :
> cd Bureau/VL4






Plus d'informations sur la liste de diffusion ubuntu-fr