Compcache breaks build in 2.6.7.2

Conrad J. Sabatier conrads at cox.net
Sun Feb 1 23:05:02 GMT 2009


Linux serene.no-ip.org 2.6.27-11-generic #1 SMP Thu Jan 29 19:28:32 UTC
2009 x86_64 GNU/Linux

  CC      ubuntu/compcache/compcache.o
ubuntu/compcache/compcache.c: In function ‘compcache_size_setup’:
ubuntu/compcache/compcache.c:465: error: implicit declaration of
function ‘strtoul’ make[2]: *** [ubuntu/compcache/compcache.o] Error 1
make[1]: *** [ubuntu/compcache] Error 2
make: *** [ubuntu] Error 2

I seem to have resolved my earlier problem with the "debug"
re-definition, by the way, simply by going thgouh my .config file and
hand-editing out all the places where *DEBUG*=y was enabled.

-- 
Conrad J. Sabatier <conrads at cox.net>



More information about the Ubuntu-bugsquad mailing list