Log for failed build of bouncycastle_1.39-2ubuntu3 (dist=karmic-autotest)
Build Daemon user
noreply at buildd.ubuntu.com
Thu Oct 22 21:57:38 BST 2009
Automatic build of bouncycastle_1.39-2ubuntu3 on clementine by sbuild/armel 1.170.5
Build started at 20091022-1849
******************************************************************************
Checking available source versions...
Fetching source files...
Reading package lists...
Building dependency tree...
Reading state information...
NOTICE: 'bouncycastle' packaging is maintained in the 'Svn' version control system at:
svn://svn.debian.org/svn/pkg-java/trunk/bouncycastle
Need to get 2789kB of source archives.
Get:1 http://archive.internal karmic-autotest/main bouncycastle 1.39-2ubuntu3 (dsc) [1693B]
Get:2 http://archive.internal karmic-autotest/main bouncycastle 1.39-2ubuntu3 (tar) [2782kB]
Get:3 http://archive.internal karmic-autotest/main bouncycastle 1.39-2ubuntu3 (diff) [5406B]
Fetched 2789kB in 0s (6995kB/s)
Download complete and in download only mode
** Using build dependencies supplied by package:
Build-Depends: cdbs (>= 0.4.27), debhelper (>= 4.1.0), ant, default-jdk-builddep, quilt, libgnumail-java, junit, ant-optional
Checking for already installed source dependencies...
cdbs: missing
debhelper: missing
ant: missing
default-jdk-builddep: missing
quilt: missing
libgnumail-java: missing
junit: missing
ant-optional: missing
Checking for source dependency conflicts...
/usr/bin/sudo /usr/bin/apt-get --purge $CHROOT_OPTIONS -q -y install cdbs debhelper ant default-jdk-builddep quilt libgnumail-java junit ant-optional
Reading package lists...
Building dependency tree...
Reading state information...
The following packages were automatically installed and are no longer required:
sudo
Use 'apt-get autoremove' to remove them.
The following extra packages will be installed:
autoconf automake autotools-dev bsdmainutils ca-certificates-java
default-jdk default-jre default-jre-headless defoma diffstat ecj ecj-gcj
ecj1 fastjar fdupes file fontconfig fontconfig-config gcj-4.4-base
gcj-4.4-jdk gcj-4.4-jre gcj-4.4-jre-headless gcj-4.4-jre-lib gcj-jdk gcj-jre
gcj-jre-headless gettext gettext-base groff-base html2text intltool
intltool-debian java-common libaccess-bridge-java libaccess-bridge-java-jni
libantlr-java libasound2 libatk1.0-0 libavahi-client3 libavahi-common-data
libavahi-common3 libcairo2 libcroco3 libcups2 libdatrie1 libdirectfb-1.2-0
libecj-java libecj-java-gcj libexpat1 libflac8 libfontconfig1 libfreetype6
libgcj-bc libgcj-common libgcj10 libgcj10-awt libgcj10-dev libgif4
libglib2.0-0 libgnuinet-java libgnujaf-java libgtk2.0-0 libgtk2.0-common
libhtml-parser-perl libhtml-tagset-perl libhtml-tree-perl libice6 libjasper1
libjaxp1.3-java libjline-java libjpeg62 liblcms1 libmagic1 libncursesw5
libnewt0.52 libnspr4-0d libnss3-1d libogg0 libpango1.0-0 libpango1.0-common
libpcre3 libpixman-1-0 libpng12-0 libpopt0 libpulse0 libpython2.6 libsm6
libsndfile1 libsqlite3-0 libsysfs2 libthai-data libthai0 libtiff4
libts-0.0-0 liburi-perl libvorbis0a libvorbisenc2 libwrap0 libwww-perl
libx11-6 libx11-data libxau6 libxcb-render-util0 libxcb-render0 libxcb1
libxcomposite1 libxcursor1 libxdamage1 libxdmcp6 libxerces2-java libxext6
libxfixes3 libxft2 libxi6 libxinerama1 libxml-parser-perl libxml2 libxrandr2
libxrender1 libxtst6 m4 man-db mime-support netbase openjdk-6-jdk
openjdk-6-jre openjdk-6-jre-headless openjdk-6-jre-lib po-debconf python
python-central python2.6 rhino shared-mime-info tsconf ttf-dejavu
ttf-dejavu-core ttf-dejavu-extra tzdata-java ucf whiptail x11-common
zlib1g-dev
Suggested packages:
ant-doc libbsf-java liboro-java libxalan2-java liblog4j1.2-java
libregexp-java jython antlr libbcel-java libcommons-logging-java
libjdepend-java libxml-commons-resolver1.1-java libcommons-net-java
libjsch-java javacc autoconf2.13 autobook autoconf-archive gnu-standards
autoconf-doc libtool wamerican wordlist whois vacation devscripts doc-base
dh-make defoma-doc psfontmgr x-ttcidfont-conf dfontmgr libft-perl
gcj-4.4-source libgcj10-dbg gettext-doc groff equivs junit-doc
libantlr-java-gcj libasound2-plugins cups-common libgcj-doc
java-virtual-machine libgnumail-java-doc librsvg2-common gvfs
libdata-dump-perl libjasper-runtime libjaxp1.3-java-gcj libjline-java-doc
liblcms-utils ttf-japanese-gothic ttf-japanese-mincho ttf-thryomanes
ttf-baekmuk ttf-arphic-gbsn00lp ttf-arphic-bsmi00lp ttf-arphic-gkai00mp
ttf-arphic-bkai00mp pulseaudio libcrypt-ssleay-perl libio-socket-ssl-perl
libxerces2-java-doc libxerces2-java-gcj less www-browser openjdk-6-demo
openjdk-6-source visualvm icedtea6-plugin libnss-mdns sun-java6-fonts
ttf-kochi-gothic ttf-sazanami-gothic ttf-kochi-mincho ttf-sazanami-mincho
ttf-wqy-zenhei ttf-indic-fonts-core ttf-telugu-fonts ttf-oriya-fonts
ttf-kannada-fonts ttf-bengali-fonts libmail-box-perl python-doc python-tk
python-profiler python2.6-doc python2.6-profiler procmail graphviz rhino-doc
Recommended packages:
ant-gcj ant-optional-gcj java-gcj-compat curl wget lynx cvs libatk1.0-data
libglib2.0-data hicolor-icon-theme libgtk2.0-bin libgpm2 libfribidi0 tcpd
libmailtools-perl libhtml-format-perl libcompress-bzip2-perl xml-core
ifupdown libxt-dev icedtea-6-jre-cacao libmail-sendmail-perl
The following NEW packages will be installed:
ant ant-optional autoconf automake autotools-dev bsdmainutils
ca-certificates-java cdbs debhelper default-jdk default-jdk-builddep
default-jre default-jre-headless defoma diffstat ecj ecj-gcj ecj1 fastjar
fdupes file fontconfig fontconfig-config gcj-4.4-base gcj-4.4-jdk
gcj-4.4-jre gcj-4.4-jre-headless gcj-4.4-jre-lib gcj-jdk gcj-jre
gcj-jre-headless gettext gettext-base groff-base html2text intltool
intltool-debian java-common junit libaccess-bridge-java
libaccess-bridge-java-jni libantlr-java libasound2 libatk1.0-0
libavahi-client3 libavahi-common-data libavahi-common3 libcairo2 libcroco3
libcups2 libdatrie1 libdirectfb-1.2-0 libecj-java libecj-java-gcj libexpat1
libflac8 libfontconfig1 libfreetype6 libgcj-bc libgcj-common libgcj10
libgcj10-awt libgcj10-dev libgif4 libglib2.0-0 libgnuinet-java
libgnujaf-java libgnumail-java libgtk2.0-0 libgtk2.0-common
libhtml-parser-perl libhtml-tagset-perl libhtml-tree-perl libice6 libjasper1
libjaxp1.3-java libjline-java libjpeg62 liblcms1 libmagic1 libncursesw5
libnewt0.52 libnspr4-0d libnss3-1d libogg0 libpango1.0-0 libpango1.0-common
libpcre3 libpixman-1-0 libpng12-0 libpopt0 libpulse0 libpython2.6 libsm6
libsndfile1 libsqlite3-0 libsysfs2 libthai-data libthai0 libtiff4
libts-0.0-0 liburi-perl libvorbis0a libvorbisenc2 libwrap0 libwww-perl
libx11-6 libx11-data libxau6 libxcb-render-util0 libxcb-render0 libxcb1
libxcomposite1 libxcursor1 libxdamage1 libxdmcp6 libxerces2-java libxext6
libxfixes3 libxft2 libxi6 libxinerama1 libxml-parser-perl libxml2 libxrandr2
libxrender1 libxtst6 m4 man-db mime-support netbase openjdk-6-jdk
openjdk-6-jre openjdk-6-jre-headless openjdk-6-jre-lib po-debconf python
python-central python2.6 quilt rhino shared-mime-info tsconf ttf-dejavu
ttf-dejavu-core ttf-dejavu-extra tzdata-java ucf whiptail x11-common
zlib1g-dev
0 upgraded, 151 newly installed, 0 to remove and 0 not upgraded.
Need to get 0B/109MB of archives.
After this operation, 334MB of additional disk space will be used.
WARNING: The following packages cannot be authenticated!
x11-common libxau6 libxdmcp6 libxcb1 libx11-data libx11-6 libxfixes3
openjdk-6-jre-lib java-common default-jre-headless ca-certificates-java
tzdata-java gcj-4.4-base mime-support libncursesw5 libsqlite3-0 python2.6
python python-central libgcj-common libgcj10 gcj-4.4-jre-headless
gcj-jre-headless libjline-java rhino libavahi-common-data libavahi-common3
libavahi-client3 libcups2 liblcms1 libjpeg62 libnspr4-0d libnss3-1d
libfreetype6 openjdk-6-jre-headless libpython2.6 libasound2 libgif4
libpng12-0 libice6 libsm6 libogg0 libflac8 libvorbis0a libvorbisenc2
libsndfile1 libwrap0 libxext6 libxtst6 libpulse0 libxi6 libxrender1 libpcre3
libglib2.0-0 libatk1.0-0 libsysfs2 tsconf libts-0.0-0 libdirectfb-1.2-0
libexpat1 ucf libnewt0.52 libpopt0 whiptail libmagic1 file defoma
ttf-dejavu-core ttf-dejavu-extra ttf-dejavu fontconfig-config libfontconfig1
libpixman-1-0 libxcb-render0 libxcb-render-util0 libcairo2 libgtk2.0-common
libjasper1 fontconfig libpango1.0-common libdatrie1 libthai-data libthai0
libxft2 libpango1.0-0 libtiff4 libxcomposite1 libxcursor1 libxdamage1
libxinerama1 libxrandr2 libxml2 shared-mime-info libgtk2.0-0
libaccess-bridge-java libaccess-bridge-java-jni openjdk-6-jre openjdk-6-jdk
netbase bsdmainutils gettext-base groff-base libhtml-tagset-perl liburi-perl
libhtml-parser-perl libhtml-tree-perl libwww-perl libxml-parser-perl man-db
libjaxp1.3-java libxerces2-java ant ant-optional m4 autoconf autotools-dev
automake html2text libcroco3 gettext intltool-debian po-debconf debhelper
fdupes intltool cdbs default-jre default-jdk libgcj10-awt gcj-4.4-jre
gcj-jre gcj-4.4-jre-lib libgcj-bc zlib1g-dev libgcj10-dev libecj-java ecj
libecj-java-gcj ecj-gcj ecj1 fastjar libantlr-java gcj-4.4-jdk gcj-jdk
default-jdk-builddep diffstat junit libgnuinet-java libgnujaf-java
libgnumail-java quilt
dpkg-preconfigure: unable to re-open stdin:
Authentication warning overridden.
Selecting previously deselected package x11-common.
(Reading database ... 10604 files and directories currently installed.)
Unpacking x11-common (from .../x11-common_1%3a7.4+3ubuntu7_all.deb) ...
Selecting previously deselected package libxau6.
Unpacking libxau6 (from .../libxau6_1%3a1.0.4-2_armel.deb) ...
Selecting previously deselected package libxdmcp6.
Unpacking libxdmcp6 (from .../libxdmcp6_1%3a1.0.2-3_armel.deb) ...
Selecting previously deselected package libxcb1.
Unpacking libxcb1 (from .../libxcb1_1.4-1_armel.deb) ...
Selecting previously deselected package libx11-data.
Unpacking libx11-data (from .../libx11-data_2%3a1.2.2-1ubuntu1_all.deb) ...
Selecting previously deselected package libx11-6.
Unpacking libx11-6 (from .../libx11-6_2%3a1.2.2-1ubuntu1_armel.deb) ...
Setting up x11-common (1:7.4+3ubuntu7) ...
Selecting previously deselected package libxfixes3.
(Reading database ... 10955 files and directories currently installed.)
Unpacking libxfixes3 (from .../libxfixes3_1%3a4.0.3-2build1_armel.deb) ...
Selecting previously deselected package openjdk-6-jre-lib.
Unpacking openjdk-6-jre-lib (from .../openjdk-6-jre-lib_6b16-1.6.1-1ubuntu3_all.deb) ...
Selecting previously deselected package java-common.
Unpacking java-common (from .../java-common_0.30ubuntu5_all.deb) ...
Selecting previously deselected package default-jre-headless.
Unpacking default-jre-headless (from .../default-jre-headless_1.6-30ubuntu5_armel.deb) ...
Selecting previously deselected package ca-certificates-java.
Unpacking ca-certificates-java (from .../ca-certificates-java_20090928_all.deb) ...
Selecting previously deselected package tzdata-java.
Unpacking tzdata-java (from .../tzdata-java_2009o-1_all.deb) ...
Selecting previously deselected package gcj-4.4-base.
Unpacking gcj-4.4-base (from .../gcj-4.4-base_4.4.1-5ubuntu2_armel.deb) ...
Selecting previously deselected package mime-support.
Unpacking mime-support (from .../mime-support_3.46-1ubuntu1_all.deb) ...
Selecting previously deselected package libncursesw5.
Unpacking libncursesw5 (from .../libncursesw5_5.7+20090803-2ubuntu2_armel.deb) ...
Selecting previously deselected package libsqlite3-0.
Unpacking libsqlite3-0 (from .../libsqlite3-0_3.6.16-1ubuntu1_armel.deb) ...
Selecting previously deselected package python2.6.
Unpacking python2.6 (from .../python2.6_2.6.4~rc2-0ubuntu1_armel.deb) ...
Selecting previously deselected package python.
Unpacking python (from .../python_2.6.4~rc1-0ubuntu1_all.deb) ...
Selecting previously deselected package python-central.
Unpacking python-central (from .../python-central_0.6.11ubuntu9_all.deb) ...
Selecting previously deselected package libgcj-common.
Unpacking libgcj-common (from .../libgcj-common_1%3a4.4.1-1ubuntu2_all.deb) ...
Selecting previously deselected package libgcj10.
Unpacking libgcj10 (from .../libgcj10_4.4.1-5ubuntu2_armel.deb) ...
Selecting previously deselected package gcj-4.4-jre-headless.
Unpacking gcj-4.4-jre-headless (from .../gcj-4.4-jre-headless_4.4.1-5ubuntu2_armel.deb) ...
Selecting previously deselected package gcj-jre-headless.
Unpacking gcj-jre-headless (from .../gcj-jre-headless_4%3a4.4.1-1ubuntu2_armel.deb) ...
Selecting previously deselected package libjline-java.
Unpacking libjline-java (from .../libjline-java_0.9.94-1ubuntu1_all.deb) ...
Selecting previously deselected package rhino.
Unpacking rhino (from .../rhino_1.7R2-1ubuntu1_all.deb) ...
Selecting previously deselected package libavahi-common-data.
Unpacking libavahi-common-data (from .../libavahi-common-data_0.6.25-1ubuntu5_armel.deb) ...
Selecting previously deselected package libavahi-common3.
Unpacking libavahi-common3 (from .../libavahi-common3_0.6.25-1ubuntu5_armel.deb) ...
Selecting previously deselected package libavahi-client3.
Unpacking libavahi-client3 (from .../libavahi-client3_0.6.25-1ubuntu5_armel.deb) ...
Selecting previously deselected package libcups2.
Unpacking libcups2 (from .../libcups2_1.4.1-5ubuntu2_armel.deb) ...
Selecting previously deselected package liblcms1.
Unpacking liblcms1 (from .../liblcms1_1.18.dfsg-1ubuntu1_armel.deb) ...
Selecting previously deselected package libjpeg62.
Unpacking libjpeg62 (from .../libjpeg62_6b-14build1_armel.deb) ...
Selecting previously deselected package libnspr4-0d.
Unpacking libnspr4-0d (from .../libnspr4-0d_4.8-0ubuntu1_armel.deb) ...
Selecting previously deselected package libnss3-1d.
Unpacking libnss3-1d (from .../libnss3-1d_3.12.3.1-0ubuntu2_armel.deb) ...
Selecting previously deselected package libfreetype6.
Unpacking libfreetype6 (from .../libfreetype6_2.3.9-5_armel.deb) ...
Selecting previously deselected package openjdk-6-jre-headless.
Unpacking openjdk-6-jre-headless (from .../openjdk-6-jre-headless_6b16-1.6.1-1ubuntu3_armel.deb) ...
Selecting previously deselected package libpython2.6.
Unpacking libpython2.6 (from .../libpython2.6_2.6.4~rc2-0ubuntu1_armel.deb) ...
Selecting previously deselected package libasound2.
Unpacking libasound2 (from .../libasound2_1.0.20-3ubuntu6_armel.deb) ...
Selecting previously deselected package libgif4.
Unpacking libgif4 (from .../libgif4_4.1.6-6_armel.deb) ...
Selecting previously deselected package libpng12-0.
Unpacking libpng12-0 (from .../libpng12-0_1.2.37-1_armel.deb) ...
Selecting previously deselected package libice6.
Unpacking libice6 (from .../libice6_2%3a1.0.5-1_armel.deb) ...
Selecting previously deselected package libsm6.
Unpacking libsm6 (from .../libsm6_2%3a1.1.0-2_armel.deb) ...
Selecting previously deselected package libogg0.
Unpacking libogg0 (from .../libogg0_1.1.4~dfsg-1_armel.deb) ...
Selecting previously deselected package libflac8.
Unpacking libflac8 (from .../libflac8_1.2.1-2build1_armel.deb) ...
Selecting previously deselected package libvorbis0a.
Unpacking libvorbis0a (from .../libvorbis0a_1.2.0.dfsg-6_armel.deb) ...
Selecting previously deselected package libvorbisenc2.
Unpacking libvorbisenc2 (from .../libvorbisenc2_1.2.0.dfsg-6_armel.deb) ...
Selecting previously deselected package libsndfile1.
Unpacking libsndfile1 (from .../libsndfile1_1.0.20-1ubuntu1_armel.deb) ...
Selecting previously deselected package libwrap0.
Unpacking libwrap0 (from .../libwrap0_7.6.q-16_armel.deb) ...
Selecting previously deselected package libxext6.
Unpacking libxext6 (from .../libxext6_2%3a1.0.99.1-0ubuntu4_armel.deb) ...
Selecting previously deselected package libxtst6.
Unpacking libxtst6 (from .../libxtst6_2%3a1.0.3-1ubuntu2_armel.deb) ...
Selecting previously deselected package libpulse0.
Unpacking libpulse0 (from .../libpulse0_1%3a0.9.19-0ubuntu3_armel.deb) ...
Selecting previously deselected package libxi6.
Unpacking libxi6 (from .../libxi6_2%3a1.2.1-2ubuntu1_armel.deb) ...
Selecting previously deselected package libxrender1.
Unpacking libxrender1 (from .../libxrender1_1%3a0.9.4-2ubuntu1_armel.deb) ...
Selecting previously deselected package libpcre3.
Unpacking libpcre3 (from .../libpcre3_7.8-3_armel.deb) ...
Selecting previously deselected package libglib2.0-0.
Unpacking libglib2.0-0 (from .../libglib2.0-0_2.22.2-0ubuntu1_armel.deb) ...
Selecting previously deselected package libatk1.0-0.
Unpacking libatk1.0-0 (from .../libatk1.0-0_1.28.0-0ubuntu1_armel.deb) ...
Selecting previously deselected package libsysfs2.
Unpacking libsysfs2 (from .../libsysfs2_2.1.0-5_armel.deb) ...
Selecting previously deselected package tsconf.
Unpacking tsconf (from .../archives/tsconf_1.0-7_all.deb) ...
Selecting previously deselected package libts-0.0-0.
Unpacking libts-0.0-0 (from .../libts-0.0-0_1.0-7_armel.deb) ...
Selecting previously deselected package libdirectfb-1.2-0.
Unpacking libdirectfb-1.2-0 (from .../libdirectfb-1.2-0_1.2.7-2ubuntu1_armel.deb) ...
Selecting previously deselected package libexpat1.
Unpacking libexpat1 (from .../libexpat1_2.0.1-4ubuntu1_armel.deb) ...
Selecting previously deselected package ucf.
Unpacking ucf (from .../ucf_3.0018ubuntu1_all.deb) ...
Moving old data out of the way
Selecting previously deselected package libnewt0.52.
Unpacking libnewt0.52 (from .../libnewt0.52_0.52.10-4ubuntu1_armel.deb) ...
Selecting previously deselected package libpopt0.
Unpacking libpopt0 (from .../libpopt0_1.14-4_armel.deb) ...
Selecting previously deselected package whiptail.
Unpacking whiptail (from .../whiptail_0.52.10-4ubuntu1_armel.deb) ...
Selecting previously deselected package libmagic1.
Unpacking libmagic1 (from .../libmagic1_5.03-1ubuntu1_armel.deb) ...
Selecting previously deselected package file.
Unpacking file (from .../file_5.03-1ubuntu1_armel.deb) ...
Selecting previously deselected package defoma.
Unpacking defoma (from .../defoma_0.11.10-0.2ubuntu1_all.deb) ...
Selecting previously deselected package ttf-dejavu-core.
Unpacking ttf-dejavu-core (from .../ttf-dejavu-core_2.29-2_all.deb) ...
Selecting previously deselected package ttf-dejavu-extra.
Unpacking ttf-dejavu-extra (from .../ttf-dejavu-extra_2.29-2_all.deb) ...
Selecting previously deselected package ttf-dejavu.
Unpacking ttf-dejavu (from .../ttf-dejavu_2.29-2_all.deb) ...
Selecting previously deselected package fontconfig-config.
Unpacking fontconfig-config (from .../fontconfig-config_2.6.0-1ubuntu12_all.deb) ...
Selecting previously deselected package libfontconfig1.
Unpacking libfontconfig1 (from .../libfontconfig1_2.6.0-1ubuntu12_armel.deb) ...
Selecting previously deselected package libpixman-1-0.
Unpacking libpixman-1-0 (from .../libpixman-1-0_0.14.0-1_armel.deb) ...
Selecting previously deselected package libxcb-render0.
Unpacking libxcb-render0 (from .../libxcb-render0_1.4-1_armel.deb) ...
Selecting previously deselected package libxcb-render-util0.
Unpacking libxcb-render-util0 (from .../libxcb-render-util0_0.3.6-1_armel.deb) ...
Selecting previously deselected package libcairo2.
Unpacking libcairo2 (from .../libcairo2_1.8.8-2ubuntu1_armel.deb) ...
Selecting previously deselected package libgtk2.0-common.
Unpacking libgtk2.0-common (from .../libgtk2.0-common_2.18.3-1_all.deb) ...
Selecting previously deselected package libjasper1.
Unpacking libjasper1 (from .../libjasper1_1.900.1-6_armel.deb) ...
Selecting previously deselected package fontconfig.
Unpacking fontconfig (from .../fontconfig_2.6.0-1ubuntu12_armel.deb) ...
Selecting previously deselected package libpango1.0-common.
Unpacking libpango1.0-common (from .../libpango1.0-common_1.26.0-1_all.deb) ...
Selecting previously deselected package libdatrie1.
Unpacking libdatrie1 (from .../libdatrie1_0.2.2-1_armel.deb) ...
Selecting previously deselected package libthai-data.
Unpacking libthai-data (from .../libthai-data_0.1.12-1_all.deb) ...
Selecting previously deselected package libthai0.
Unpacking libthai0 (from .../libthai0_0.1.12-1_armel.deb) ...
Selecting previously deselected package libxft2.
Unpacking libxft2 (from .../libxft2_2.1.13-3ubuntu1_armel.deb) ...
Selecting previously deselected package libpango1.0-0.
Unpacking libpango1.0-0 (from .../libpango1.0-0_1.26.0-1_armel.deb) ...
Selecting previously deselected package libtiff4.
Unpacking libtiff4 (from .../libtiff4_3.8.2-13_armel.deb) ...
Selecting previously deselected package libxcomposite1.
Unpacking libxcomposite1 (from .../libxcomposite1_1%3a0.4.0-4_armel.deb) ...
Selecting previously deselected package libxcursor1.
Unpacking libxcursor1 (from .../libxcursor1_1%3a1.1.9-1build1_armel.deb) ...
Selecting previously deselected package libxdamage1.
Unpacking libxdamage1 (from .../libxdamage1_1%3a1.1.1-4_armel.deb) ...
Selecting previously deselected package libxinerama1.
Unpacking libxinerama1 (from .../libxinerama1_2%3a1.0.3-2_armel.deb) ...
Selecting previously deselected package libxrandr2.
Unpacking libxrandr2 (from .../libxrandr2_2%3a1.3.0-2_armel.deb) ...
Selecting previously deselected package libxml2.
Unpacking libxml2 (from .../libxml2_2.7.5.dfsg-1ubuntu1_armel.deb) ...
Selecting previously deselected package shared-mime-info.
Unpacking shared-mime-info (from .../shared-mime-info_0.70-0ubuntu1_armel.deb) ...
Selecting previously deselected package libgtk2.0-0.
Unpacking libgtk2.0-0 (from .../libgtk2.0-0_2.18.3-1_armel.deb) ...
Selecting previously deselected package libaccess-bridge-java.
Unpacking libaccess-bridge-java (from .../libaccess-bridge-java_1.26.2-1ubuntu1_all.deb) ...
Selecting previously deselected package libaccess-bridge-java-jni.
Unpacking libaccess-bridge-java-jni (from .../libaccess-bridge-java-jni_1.26.2-1ubuntu1_armel.deb) ...
Selecting previously deselected package openjdk-6-jre.
Unpacking openjdk-6-jre (from .../openjdk-6-jre_6b16-1.6.1-1ubuntu3_armel.deb) ...
Selecting previously deselected package openjdk-6-jdk.
Unpacking openjdk-6-jdk (from .../openjdk-6-jdk_6b16-1.6.1-1ubuntu3_armel.deb) ...
Selecting previously deselected package netbase.
Unpacking netbase (from .../netbase_4.35ubuntu2_all.deb) ...
Selecting previously deselected package bsdmainutils.
Unpacking bsdmainutils (from .../bsdmainutils_6.1.10ubuntu4_armel.deb) ...
Selecting previously deselected package gettext-base.
Unpacking gettext-base (from .../gettext-base_0.17-8ubuntu1_armel.deb) ...
Selecting previously deselected package groff-base.
Unpacking groff-base (from .../groff-base_1.20.1-5_armel.deb) ...
Selecting previously deselected package libhtml-tagset-perl.
Unpacking libhtml-tagset-perl (from .../libhtml-tagset-perl_3.20-2_all.deb) ...
Selecting previously deselected package liburi-perl.
Unpacking liburi-perl (from .../liburi-perl_1.37+dfsg-1ubuntu1_all.deb) ...
Selecting previously deselected package libhtml-parser-perl.
Unpacking libhtml-parser-perl (from .../libhtml-parser-perl_3.61-1_armel.deb) ...
Selecting previously deselected package libhtml-tree-perl.
Unpacking libhtml-tree-perl (from .../libhtml-tree-perl_3.23-1_all.deb) ...
Selecting previously deselected package libwww-perl.
Unpacking libwww-perl (from .../libwww-perl_5.831-1_all.deb) ...
Selecting previously deselected package libxml-parser-perl.
Unpacking libxml-parser-perl (from .../libxml-parser-perl_2.36-1.1build2_armel.deb) ...
Selecting previously deselected package man-db.
Unpacking man-db (from .../man-db_2.5.6-2_armel.deb) ...
Selecting previously deselected package libjaxp1.3-java.
Unpacking libjaxp1.3-java (from .../libjaxp1.3-java_1.3.04-5ubuntu2_armel.deb) ...
Selecting previously deselected package libxerces2-java.
Unpacking libxerces2-java (from .../libxerces2-java_2.9.1-4ubuntu1_all.deb) ...
Selecting previously deselected package ant.
Unpacking ant (from .../archives/ant_1.7.1-4_all.deb) ...
Selecting previously deselected package ant-optional.
Unpacking ant-optional (from .../ant-optional_1.7.1-4_all.deb) ...
Selecting previously deselected package m4.
Unpacking m4 (from .../archives/m4_1.4.13-2_armel.deb) ...
Selecting previously deselected package autoconf.
Unpacking autoconf (from .../autoconf_2.64-1ubuntu1_all.deb) ...
Selecting previously deselected package autotools-dev.
Unpacking autotools-dev (from .../autotools-dev_20090427.1_all.deb) ...
Selecting previously deselected package automake.
Unpacking automake (from .../automake_1%3a1.11-1_all.deb) ...
Selecting previously deselected package html2text.
Unpacking html2text (from .../html2text_1.3.2a-14_armel.deb) ...
Selecting previously deselected package libcroco3.
Unpacking libcroco3 (from .../libcroco3_0.6.1-2_armel.deb) ...
Selecting previously deselected package gettext.
Unpacking gettext (from .../gettext_0.17-8ubuntu1_armel.deb) ...
Selecting previously deselected package intltool-debian.
Unpacking intltool-debian (from .../intltool-debian_0.35.0+20060710.1_all.deb) ...
Selecting previously deselected package po-debconf.
Unpacking po-debconf (from .../po-debconf_1.0.16_all.deb) ...
Selecting previously deselected package debhelper.
Unpacking debhelper (from .../debhelper_7.3.15ubuntu3_all.deb) ...
Selecting previously deselected package fdupes.
Unpacking fdupes (from .../fdupes_1.50-PR2-2_armel.deb) ...
Selecting previously deselected package intltool.
Unpacking intltool (from .../intltool_0.41.0-0ubuntu1_all.deb) ...
Selecting previously deselected package cdbs.
Unpacking cdbs (from .../cdbs_0.4.59ubuntu4_all.deb) ...
Selecting previously deselected package default-jre.
Unpacking default-jre (from .../default-jre_1.6-30ubuntu5_armel.deb) ...
Selecting previously deselected package default-jdk.
Unpacking default-jdk (from .../default-jdk_1.6-30ubuntu5_armel.deb) ...
Selecting previously deselected package libgcj10-awt.
Unpacking libgcj10-awt (from .../libgcj10-awt_4.4.1-5ubuntu2_armel.deb) ...
Selecting previously deselected package gcj-4.4-jre.
Unpacking gcj-4.4-jre (from .../gcj-4.4-jre_4.4.1-5ubuntu2_armel.deb) ...
Selecting previously deselected package gcj-jre.
Unpacking gcj-jre (from .../gcj-jre_4%3a4.4.1-1ubuntu2_armel.deb) ...
Selecting previously deselected package gcj-4.4-jre-lib.
Unpacking gcj-4.4-jre-lib (from .../gcj-4.4-jre-lib_4.4.1-5ubuntu2_all.deb) ...
Selecting previously deselected package libgcj-bc.
Unpacking libgcj-bc (from .../libgcj-bc_4.4.1-1ubuntu2_armel.deb) ...
Selecting previously deselected package zlib1g-dev.
Unpacking zlib1g-dev (from .../zlib1g-dev_1%3a1.2.3.3.dfsg-13ubuntu3_armel.deb) ...
Selecting previously deselected package libgcj10-dev.
Unpacking libgcj10-dev (from .../libgcj10-dev_4.4.1-5ubuntu2_armel.deb) ...
Selecting previously deselected package libecj-java.
Unpacking libecj-java (from .../libecj-java_3.5.1-0ubuntu1_all.deb) ...
Selecting previously deselected package ecj.
Unpacking ecj (from .../ecj_3.5.1-0ubuntu1_armel.deb) ...
Selecting previously deselected package libecj-java-gcj.
Unpacking libecj-java-gcj (from .../libecj-java-gcj_3.5.1-0ubuntu1_armel.deb) ...
Selecting previously deselected package ecj-gcj.
Unpacking ecj-gcj (from .../ecj-gcj_3.5.1-0ubuntu1_armel.deb) ...
Selecting previously deselected package ecj1.
Unpacking ecj1 (from .../ecj1_3.5.1-0ubuntu1_armel.deb) ...
Selecting previously deselected package fastjar.
Unpacking fastjar (from .../fastjar_2%3a0.98-1_armel.deb) ...
Selecting previously deselected package libantlr-java.
Unpacking libantlr-java (from .../libantlr-java_2.7.7-11ubuntu1_all.deb) ...
Selecting previously deselected package gcj-4.4-jdk.
Unpacking gcj-4.4-jdk (from .../gcj-4.4-jdk_4.4.1-5ubuntu2_armel.deb) ...
Selecting previously deselected package gcj-jdk.
Unpacking gcj-jdk (from .../gcj-jdk_4%3a4.4.1-1ubuntu2_armel.deb) ...
Selecting previously deselected package default-jdk-builddep.
Unpacking default-jdk-builddep (from .../default-jdk-builddep_1.6-30ubuntu5_armel.deb) ...
Selecting previously deselected package diffstat.
Unpacking diffstat (from .../diffstat_1.47-1_armel.deb) ...
Selecting previously deselected package junit.
Unpacking junit (from .../archives/junit_3.8.2-3_all.deb) ...
Selecting previously deselected package libgnuinet-java.
Unpacking libgnuinet-java (from .../libgnuinet-java_1.1.1-3ubuntu2_all.deb) ...
Selecting previously deselected package libgnujaf-java.
Unpacking libgnujaf-java (from .../libgnujaf-java_1.1.1-4ubuntu2_all.deb) ...
Selecting previously deselected package libgnumail-java.
Unpacking libgnumail-java (from .../libgnumail-java_1.1.2-2ubuntu2_all.deb) ...
Selecting previously deselected package quilt.
Unpacking quilt (from .../quilt_0.46-8ubuntu1_all.deb) ...
Setting up libxau6 (1:1.0.4-2) ...
Setting up libxdmcp6 (1:1.0.2-3) ...
Setting up libxcb1 (1.4-1) ...
Setting up libx11-data (2:1.2.2-1ubuntu1) ...
Setting up libx11-6 (2:1.2.2-1ubuntu1) ...
Setting up libxfixes3 (1:4.0.3-2build1) ...
Setting up java-common (0.30ubuntu5) ...
Setting up tzdata-java (2009o-1) ...
Setting up gcj-4.4-base (4.4.1-5ubuntu2) ...
Setting up mime-support (3.46-1ubuntu1) ...
update-alternatives: using /usr/bin/see to provide /usr/bin/view (view) in auto mode.
Setting up libncursesw5 (5.7+20090803-2ubuntu2) ...
Setting up libsqlite3-0 (3.6.16-1ubuntu1) ...
Setting up python2.6 (2.6.4~rc2-0ubuntu1) ...
Setting up python (2.6.4~rc1-0ubuntu1) ...
Setting up python-central (0.6.11ubuntu9) ...
Setting up libgcj-common (1:4.4.1-1ubuntu2) ...
Setting up libgcj10 (4.4.1-5ubuntu2) ...
Setting up gcj-4.4-jre-headless (4.4.1-5ubuntu2) ...
gcj-dbtool succeeded unexpectedly
Setting up gcj-jre-headless (4:4.4.1-1ubuntu2) ...
Setting up libjline-java (0.9.94-1ubuntu1) ...
Setting up rhino (1.7R2-1ubuntu1) ...
update-alternatives: using /usr/bin/rhino to provide /usr/bin/js (js) in auto mode.
Setting up libavahi-common-data (0.6.25-1ubuntu5) ...
Setting up libavahi-common3 (0.6.25-1ubuntu5) ...
Setting up libavahi-client3 (0.6.25-1ubuntu5) ...
Setting up libcups2 (1.4.1-5ubuntu2) ...
Setting up liblcms1 (1.18.dfsg-1ubuntu1) ...
Setting up libjpeg62 (6b-14build1) ...
Setting up libnspr4-0d (4.8-0ubuntu1) ...
Setting up libnss3-1d (3.12.3.1-0ubuntu2) ...
Setting up libfreetype6 (2.3.9-5) ...
Setting up libpython2.6 (2.6.4~rc2-0ubuntu1) ...
Setting up libasound2 (1.0.20-3ubuntu6) ...
Setting up libgif4 (4.1.6-6) ...
Setting up libpng12-0 (1.2.37-1) ...
Setting up libice6 (2:1.0.5-1) ...
Setting up libsm6 (2:1.1.0-2) ...
Setting up libogg0 (1.1.4~dfsg-1) ...
Setting up libflac8 (1.2.1-2build1) ...
Setting up libvorbis0a (1.2.0.dfsg-6) ...
Setting up libvorbisenc2 (1.2.0.dfsg-6) ...
Setting up libsndfile1 (1.0.20-1ubuntu1) ...
Setting up libwrap0 (7.6.q-16) ...
Setting up libxext6 (2:1.0.99.1-0ubuntu4) ...
Setting up libxtst6 (2:1.0.3-1ubuntu2) ...
Setting up libpulse0 (1:0.9.19-0ubuntu3) ...
Setting up libxi6 (2:1.2.1-2ubuntu1) ...
Setting up libxrender1 (1:0.9.4-2ubuntu1) ...
Setting up libpcre3 (7.8-3) ...
Setting up libglib2.0-0 (2.22.2-0ubuntu1) ...
Setting up libatk1.0-0 (1.28.0-0ubuntu1) ...
Setting up libsysfs2 (2.1.0-5) ...
Setting up tsconf (1.0-7) ...
Setting up libts-0.0-0 (1.0-7) ...
Setting up libdirectfb-1.2-0 (1.2.7-2ubuntu1) ...
Setting up libexpat1 (2.0.1-4ubuntu1) ...
Setting up ucf (3.0018ubuntu1) ...
Setting up libnewt0.52 (0.52.10-4ubuntu1) ...
Setting up libpopt0 (1.14-4) ...
Setting up whiptail (0.52.10-4ubuntu1) ...
Setting up libmagic1 (5.03-1ubuntu1) ...
Setting up file (5.03-1ubuntu1) ...
Setting up defoma (0.11.10-0.2ubuntu1) ...
Setting up ttf-dejavu-core (2.29-2) ...
Setting up ttf-dejavu-extra (2.29-2) ...
Setting up ttf-dejavu (2.29-2) ...
Setting up fontconfig-config (2.6.0-1ubuntu12) ...
Setting up libfontconfig1 (2.6.0-1ubuntu12) ...
Setting up libpixman-1-0 (0.14.0-1) ...
Setting up libxcb-render0 (1.4-1) ...
Setting up libxcb-render-util0 (0.3.6-1) ...
Setting up libcairo2 (1.8.8-2ubuntu1) ...
Setting up libgtk2.0-common (2.18.3-1) ...
Setting up libjasper1 (1.900.1-6) ...
Setting up fontconfig (2.6.0-1ubuntu12) ...
Updating font configuration of fontconfig...
Cleaning up category cid..
Cleaning up category truetype..
Cleaning up category type1..
Updating category type1..
Updating category truetype..
Updating category cid..
Updating fontconfig cache for /usr/share/fonts/truetype/ttf-dejavu
Cleaning up old fontconfig caches... done.
Regenerating fonts cache... done.
Setting up libpango1.0-common (1.26.0-1) ...
Cleaning up font configuration of pango...
Updating font configuration of pango...
Cleaning up category xfont..
Updating category xfont..
*** You don't have any defomized font packages.
*** So we are trying to force to generate pangox.aliases...
Setting up libdatrie1 (0.2.2-1) ...
Setting up libthai-data (0.1.12-1) ...
Setting up libthai0 (0.1.12-1) ...
Setting up libxft2 (2.1.13-3ubuntu1) ...
Setting up libpango1.0-0 (1.26.0-1) ...
Setting up libtiff4 (3.8.2-13) ...
Setting up libxcomposite1 (1:0.4.0-4) ...
Setting up libxcursor1 (1:1.1.9-1build1) ...
Setting up libxdamage1 (1:1.1.1-4) ...
Setting up libxinerama1 (2:1.0.3-2) ...
Setting up libxrandr2 (2:1.3.0-2) ...
Setting up libxml2 (2.7.5.dfsg-1ubuntu1) ...
Setting up shared-mime-info (0.70-0ubuntu1) ...
Setting up libgtk2.0-0 (2.18.3-1) ...
Setting up netbase (4.35ubuntu2) ...
Setting up bsdmainutils (6.1.10ubuntu4) ...
update-alternatives: using /usr/bin/bsd-write to provide /usr/bin/write (write) in auto mode.
Setting up gettext-base (0.17-8ubuntu1) ...
Setting up groff-base (1.20.1-5) ...
Setting up libhtml-tagset-perl (3.20-2) ...
Setting up liburi-perl (1.37+dfsg-1ubuntu1) ...
Setting up libhtml-parser-perl (3.61-1) ...
Setting up libhtml-tree-perl (3.23-1) ...
Setting up libwww-perl (5.831-1) ...
Setting up libxml-parser-perl (2.36-1.1build2) ...
Setting up man-db (2.5.6-2) ...
Building database of manual pages ...
... skipping, since this is a buildd
Setting up libjaxp1.3-java (1.3.04-5ubuntu2) ...
Setting up libxerces2-java (2.9.1-4ubuntu1) ...
Setting up ant (1.7.1-4) ...
Setting up ant-optional (1.7.1-4) ...
Setting up m4 (1.4.13-2) ...
Setting up autoconf (2.64-1ubuntu1) ...
install-info: warning: maintainer scripts should not call install-info anymore,
install-info: warning: this is handled now by a dpkg trigger provided by the
install-info: warning: install-info package; package autoconf should be updated.
install-info: warning: maintainer scripts should not call install-info anymore,
install-info: warning: this is handled now by a dpkg trigger provided by the
install-info: warning: install-info package; package autoconf should be updated.
install-info: warning: maintainer scripts should not call install-info anymore,
install-info: warning: this is handled now by a dpkg trigger provided by the
install-info: warning: install-info package; package autoconf should be updated.
Setting up autotools-dev (20090427.1) ...
Setting up automake (1:1.11-1) ...
update-alternatives: using /usr/bin/automake-1.11 to provide /usr/bin/automake (automake) in auto mode.
Setting up html2text (1.3.2a-14) ...
Setting up libcroco3 (0.6.1-2) ...
Setting up gettext (0.17-8ubuntu1) ...
Setting up intltool-debian (0.35.0+20060710.1) ...
Setting up po-debconf (1.0.16) ...
Setting up debhelper (7.3.15ubuntu3) ...
Setting up fdupes (1.50-PR2-2) ...
Setting up intltool (0.41.0-0ubuntu1) ...
Setting up cdbs (0.4.59ubuntu4) ...
Setting up libgcj10-awt (4.4.1-5ubuntu2) ...
Setting up gcj-4.4-jre (4.4.1-5ubuntu2) ...
Setting up gcj-jre (4:4.4.1-1ubuntu2) ...
Setting up gcj-4.4-jre-lib (4.4.1-5ubuntu2) ...
Setting up libgcj-bc (4.4.1-1ubuntu2) ...
Setting up zlib1g-dev (1:1.2.3.3.dfsg-13ubuntu3) ...
Setting up libecj-java (3.5.1-0ubuntu1) ...
Setting up ecj (3.5.1-0ubuntu1) ...
Setting up libecj-java-gcj (3.5.1-0ubuntu1) ...
gcj-dbtool-4.4 succeeded unexpectedly
Setting up ecj-gcj (3.5.1-0ubuntu1) ...
Setting up ecj1 (3.5.1-0ubuntu1) ...
Setting up fastjar (2:0.98-1) ...
Setting up libantlr-java (2.7.7-11ubuntu1) ...
Setting up diffstat (1.47-1) ...
Setting up junit (3.8.2-3) ...
Setting up libgnuinet-java (1.1.1-3ubuntu2) ...
Setting up libgnujaf-java (1.1.1-4ubuntu2) ...
Setting up libgnumail-java (1.1.2-2ubuntu2) ...
Setting up quilt (0.46-8ubuntu1) ...
Setting up openjdk-6-jre-lib (6b16-1.6.1-1ubuntu3) ...
Setting up default-jre-headless (1.6-30ubuntu5) ...
Setting up ca-certificates-java (20090928) ...
creating /etc/ssl/certs/java/cacerts...
done.
Setting up openjdk-6-jre-headless (6b16-1.6.1-1ubuntu3) ...
update-alternatives: using /usr/lib/jvm/java-6-openjdk/jre/bin/java to provide /usr/bin/java (java) in auto mode.
update-alternatives: using /usr/lib/jvm/java-6-openjdk/jre/bin/keytool to provide /usr/bin/keytool (keytool) in auto mode.
update-alternatives: using /usr/lib/jvm/java-6-openjdk/jre/bin/pack200 to provide /usr/bin/pack200 (pack200) in auto mode.
update-alternatives: using /usr/lib/jvm/java-6-openjdk/jre/bin/rmid to provide /usr/bin/rmid (rmid) in auto mode.
update-alternatives: using /usr/lib/jvm/java-6-openjdk/jre/bin/rmiregistry to provide /usr/bin/rmiregistry (rmiregistry) in auto mode.
update-alternatives: using /usr/lib/jvm/java-6-openjdk/jre/bin/unpack200 to provide /usr/bin/unpack200 (unpack200) in auto mode.
update-alternatives: using /usr/lib/jvm/java-6-openjdk/jre/bin/orbd to provide /usr/bin/orbd (orbd) in auto mode.
update-alternatives: using /usr/lib/jvm/java-6-openjdk/jre/bin/servertool to provide /usr/bin/servertool (servertool) in auto mode.
update-alternatives: using /usr/lib/jvm/java-6-openjdk/jre/bin/tnameserv to provide /usr/bin/tnameserv (tnameserv) in auto mode.
update-alternatives: using /usr/lib/jvm/java-6-openjdk/jre/lib/jexec to provide /usr/bin/jexec (jexec) in auto mode.
Setting up libaccess-bridge-java (1.26.2-1ubuntu1) ...
Setting up libaccess-bridge-java-jni (1.26.2-1ubuntu1) ...
Setting up openjdk-6-jre (6b16-1.6.1-1ubuntu3) ...
update-alternatives: using /usr/lib/jvm/java-6-openjdk/jre/bin/javaws to provide /usr/bin/javaws (javaws) in auto mode.
update-alternatives: using /usr/lib/jvm/java-6-openjdk/jre/bin/pluginappletviewer to provide /usr/bin/pluginappletviewer (pluginappletviewer) in auto mode.
update-alternatives: using /usr/lib/jvm/java-6-openjdk/jre/bin/policytool to provide /usr/bin/policytool (policytool) in auto mode.
Setting up openjdk-6-jdk (6b16-1.6.1-1ubuntu3) ...
update-alternatives: using /usr/lib/jvm/java-6-openjdk/bin/appletviewer to provide /usr/bin/appletviewer (appletviewer) in auto mode.
update-alternatives: using /usr/lib/jvm/java-6-openjdk/bin/apt to provide /usr/bin/apt (apt) in auto mode.
update-alternatives: using /usr/lib/jvm/java-6-openjdk/bin/extcheck to provide /usr/bin/extcheck (extcheck) in auto mode.
update-alternatives: using /usr/lib/jvm/java-6-openjdk/bin/idlj to provide /usr/bin/idlj (idlj) in auto mode.
update-alternatives: using /usr/lib/jvm/java-6-openjdk/bin/jar to provide /usr/bin/jar (jar) in auto mode.
update-alternatives: using /usr/lib/jvm/java-6-openjdk/bin/jarsigner to provide /usr/bin/jarsigner (jarsigner) in auto mode.
update-alternatives: using /usr/lib/jvm/java-6-openjdk/bin/javac to provide /usr/bin/javac (javac) in auto mode.
update-alternatives: using /usr/lib/jvm/java-6-openjdk/bin/javadoc to provide /usr/bin/javadoc (javadoc) in auto mode.
update-alternatives: using /usr/lib/jvm/java-6-openjdk/bin/javah to provide /usr/bin/javah (javah) in auto mode.
update-alternatives: using /usr/lib/jvm/java-6-openjdk/bin/javap to provide /usr/bin/javap (javap) in auto mode.
update-alternatives: using /usr/lib/jvm/java-6-openjdk/bin/jconsole to provide /usr/bin/jconsole (jconsole) in auto mode.
update-alternatives: using /usr/lib/jvm/java-6-openjdk/bin/jdb to provide /usr/bin/jdb (jdb) in auto mode.
update-alternatives: using /usr/lib/jvm/java-6-openjdk/bin/jhat to provide /usr/bin/jhat (jhat) in auto mode.
update-alternatives: using /usr/lib/jvm/java-6-openjdk/bin/jinfo to provide /usr/bin/jinfo (jinfo) in auto mode.
update-alternatives: using /usr/lib/jvm/java-6-openjdk/bin/jmap to provide /usr/bin/jmap (jmap) in auto mode.
update-alternatives: using /usr/lib/jvm/java-6-openjdk/bin/jps to provide /usr/bin/jps (jps) in auto mode.
update-alternatives: using /usr/lib/jvm/java-6-openjdk/bin/jrunscript to provide /usr/bin/jrunscript (jrunscript) in auto mode.
update-alternatives: using /usr/lib/jvm/java-6-openjdk/bin/jsadebugd to provide /usr/bin/jsadebugd (jsadebugd) in auto mode.
update-alternatives: using /usr/lib/jvm/java-6-openjdk/bin/jstack to provide /usr/bin/jstack (jstack) in auto mode.
update-alternatives: using /usr/lib/jvm/java-6-openjdk/bin/jstat to provide /usr/bin/jstat (jstat) in auto mode.
update-alternatives: using /usr/lib/jvm/java-6-openjdk/bin/jstatd to provide /usr/bin/jstatd (jstatd) in auto mode.
update-alternatives: using /usr/lib/jvm/java-6-openjdk/bin/native2ascii to provide /usr/bin/native2ascii (native2ascii) in auto mode.
update-alternatives: using /usr/lib/jvm/java-6-openjdk/bin/rmic to provide /usr/bin/rmic (rmic) in auto mode.
update-alternatives: using /usr/lib/jvm/java-6-openjdk/bin/schemagen to provide /usr/bin/schemagen (schemagen) in auto mode.
update-alternatives: using /usr/lib/jvm/java-6-openjdk/bin/serialver to provide /usr/bin/serialver (serialver) in auto mode.
update-alternatives: using /usr/lib/jvm/java-6-openjdk/bin/wsgen to provide /usr/bin/wsgen (wsgen) in auto mode.
update-alternatives: using /usr/lib/jvm/java-6-openjdk/bin/wsimport to provide /usr/bin/wsimport (wsimport) in auto mode.
update-alternatives: using /usr/lib/jvm/java-6-openjdk/bin/xjc to provide /usr/bin/xjc (xjc) in auto mode.
Setting up default-jre (1.6-30ubuntu5) ...
Setting up default-jdk (1.6-30ubuntu5) ...
Setting up libgcj10-dev (4.4.1-5ubuntu2) ...
Setting up gcj-4.4-jdk (4.4.1-5ubuntu2) ...
install-info: warning: maintainer scripts should not call install-info anymore,
install-info: warning: this is handled now by a dpkg trigger provided by the
install-info: warning: install-info package; package gcj-4.4-jdk should be updated.
Setting up gcj-jdk (4:4.4.1-1ubuntu2) ...
Setting up default-jdk-builddep (1.6-30ubuntu5) ...
Processing triggers for libc-bin ...
ldconfig deferred processing now taking place
Checking correctness of source dependencies...
Toolchain package versions: libc6-dev_2.10.1-0ubuntu15 make_3.81-6 dpkg-dev_1.15.4ubuntu2 linux-libc-dev_2.6.31-14.48 g++-4.4_4.4.1-4ubuntu8 gcc-4.4_4.4.1-4ubuntu8 binutils_2.20-0ubuntu1 libstdc++6_4.4.1-4ubuntu8 libstdc++6-4.4-dev_4.4.1-4ubuntu8
------------------------------------------------------------------------------
gpg: Signature made Fri Jul 3 12:57:17 2009 BST using DSA key ID B6A55F4F
gpg: Can't check signature: public key not found
dpkg-source: extracting bouncycastle in bouncycastle-1.39
dpkg-source: info: unpacking bouncycastle_1.39.orig.tar.gz
dpkg-source: info: applying bouncycastle_1.39-2ubuntu3.diff.gz
dpkg-buildpackage: set CFLAGS to default value: -g -O2
dpkg-buildpackage: set CPPFLAGS to default value:
dpkg-buildpackage: set LDFLAGS to default value: -Wl,-Bsymbolic-functions
dpkg-buildpackage: set FFLAGS to default value: -g -O2
dpkg-buildpackage: set CXXFLAGS to default value: -g -O2
dpkg-buildpackage: source package bouncycastle
dpkg-buildpackage: source version 1.39-2ubuntu3
dpkg-buildpackage: host architecture armel
/usr/bin/fakeroot debian/rules clean
test -x debian/rules
dh_testroot
dh_clean
/usr/bin/make -f debian/rules reverse-config
make[1]: Entering directory `/build/buildd/bouncycastle-1.39'
make[1]: Nothing to be done for `reverse-config'.
make[1]: Leaving directory `/build/buildd/bouncycastle-1.39'
if [ -d "." ]; then \
cd . && QUILT_PATCHES=/build/buildd/bouncycastle-1.39/debian/patches quilt --quiltrc /dev/null pop -a -R || test $? = 2 ; \
fi
No patch removed
rm -rf ./.pc
rm -f debian/stamp-patch*
rm -f stamp-*
rm -rf build debian/build
rm -f *.bpg test.* large.* secret.asc pub.asc
debian/rules build
test -x debian/rules
mkdir -p "."
/usr/bin/make -f debian/rules reverse-config
make[1]: Entering directory `/build/buildd/bouncycastle-1.39'
make[1]: Nothing to be done for `reverse-config'.
make[1]: Leaving directory `/build/buildd/bouncycastle-1.39'
cd . && QUILT_PATCHES=/build/buildd/bouncycastle-1.39/debian/patches quilt --quiltrc /dev/null push -a || test $? = 2
Applying patch 01_build.patch
patching file build1-4
Applying patch 02_index.patch
patching file index.html
Now at patch 02_index.patch
touch debian/stamp-patched
/usr/bin/make -f debian/rules update-config
make[1]: Entering directory `/build/buildd/bouncycastle-1.39'
make[1]: Nothing to be done for `update-config'.
make[1]: Leaving directory `/build/buildd/bouncycastle-1.39'
sh -x ./build1-4
+ JDKPATH=/usr/lib/jvm/default-java
+ JAVA_MAIL_HOME=/usr/share/java
+ JAVA_ACTIVATION_HOME=/usr/share/java
+ JAVA_HOME=/usr/lib/jvm/default-java
+ export JAVA_HOME
+ PATH=/usr/lib/jvm/default-java/bin:/usr/local/sbin:/usr/local/bin:/usr/sbin:/usr/bin:/sbin:/bin:/usr/X11R6/bin:/usr/games
+ export PATH
+ CLASSPATH=/usr/share/java/gnumail.jar:/usr/share/java/activation.jar:
+ export CLASSPATH
+ [ = test ]
+ ant -f jdk14.xml build-provider
Buildfile: jdk14.xml
init:
[mkdir] Created dir: /build/buildd/bouncycastle-1.39/build/jdk1.4
[mkdir] Created dir: /build/buildd/bouncycastle-1.39/build/artifacts/jdk1.4
[mkdir] Created dir: /build/buildd/bouncycastle-1.39/build/artifacts/jdk1.4/reports
[mkdir] Created dir: /build/buildd/bouncycastle-1.39/build/artifacts/jdk1.4/reports/xml
[mkdir] Created dir: /build/buildd/bouncycastle-1.39/build/artifacts/jdk1.4/reports/html
[mkdir] Created dir: /build/buildd/bouncycastle-1.39/build/artifacts/jdk1.4/jars
[mkdir] Created dir: /build/buildd/bouncycastle-1.39/build/artifacts/jdk1.4/checkstyle
[copy] Copying 2185 files to /build/buildd/bouncycastle-1.39/build/jdk1.4
[copy] Copying 23 files to /build/buildd/bouncycastle-1.39/build/jdk1.4
checkstyle-on:
checkstyle-off:
build-provider:
build-provider:
[mkdir] Created dir: /build/buildd/bouncycastle-1.39/build/artifacts/jdk1.4/bcprov-jdk14-139
[copy] Copying 5 files to /build/buildd/bouncycastle-1.39/build/artifacts/jdk1.4/bcprov-jdk14-139
[copy] Copying 1636 files to /build/buildd/bouncycastle-1.39/build/artifacts/jdk1.4/bcprov-jdk14-139/src
[copy] Copied 116 empty directories to 12 empty directories under /build/buildd/bouncycastle-1.39/build/artifacts/jdk1.4/bcprov-jdk14-139/src
[mkdir] Created dir: /build/buildd/bouncycastle-1.39/build/bcprov-jdk14-139/classes
[javac] Compiling 891 source files to /build/buildd/bouncycastle-1.39/build/bcprov-jdk14-139/classes
[javac] /build/buildd/bouncycastle-1.39/build/artifacts/jdk1.4/bcprov-jdk14-139/src/org/bouncycastle/asn1/gnu/GNUObjectIdentifiers.java:8: warning: unmappable character for encoding ASCII
[javac] public static final DERObjectIdentifier GnuPG = new DERObjectIdentifier("1.3.6.1.4.1.11591.2"); // GnuPG (??gypten)
[javac] ^
[javac] /build/buildd/bouncycastle-1.39/build/artifacts/jdk1.4/bcprov-jdk14-139/src/org/bouncycastle/asn1/gnu/GNUObjectIdentifiers.java:8: warning: unmappable character for encoding ASCII
[javac] public static final DERObjectIdentifier GnuPG = new DERObjectIdentifier("1.3.6.1.4.1.11591.2"); // GnuPG (??gypten)
[javac] ^
[javac] /build/buildd/bouncycastle-1.39/build/artifacts/jdk1.4/bcprov-jdk14-139/src/org/bouncycastle/asn1/isismtt/ISISMTTObjectIdentifiers.java:72: warning: unmappable character for encoding ASCII
[javac] * certificate and that is used as ???security anchor???.
[javac] ^
[javac] /build/buildd/bouncycastle-1.39/build/artifacts/jdk1.4/bcprov-jdk14-139/src/org/bouncycastle/asn1/isismtt/ISISMTTObjectIdentifiers.java:72: warning: unmappable character for encoding ASCII
[javac] * certificate and that is used as ???security anchor???.
[javac] ^
[javac] /build/buildd/bouncycastle-1.39/build/artifacts/jdk1.4/bcprov-jdk14-139/src/org/bouncycastle/asn1/isismtt/ISISMTTObjectIdentifiers.java:72: warning: unmappable character for encoding ASCII
[javac] * certificate and that is used as ???security anchor???.
[javac] ^
[javac] /build/buildd/bouncycastle-1.39/build/artifacts/jdk1.4/bcprov-jdk14-139/src/org/bouncycastle/asn1/isismtt/ISISMTTObjectIdentifiers.java:72: warning: unmappable character for encoding ASCII
[javac] * certificate and that is used as ???security anchor???.
[javac] ^
[javac] /build/buildd/bouncycastle-1.39/build/artifacts/jdk1.4/bcprov-jdk14-139/src/org/bouncycastle/asn1/isismtt/ISISMTTObjectIdentifiers.java:72: warning: unmappable character for encoding ASCII
[javac] * certificate and that is used as ???security anchor???.
[javac] ^
[javac] /build/buildd/bouncycastle-1.39/build/artifacts/jdk1.4/bcprov-jdk14-139/src/org/bouncycastle/asn1/isismtt/ISISMTTObjectIdentifiers.java:72: warning: unmappable character for encoding ASCII
[javac] * certificate and that is used as ???security anchor???.
[javac] ^
[javac] /build/buildd/bouncycastle-1.39/build/artifacts/jdk1.4/bcprov-jdk14-139/src/org/bouncycastle/asn1/isismtt/ocsp/RequestedCertificate.java:22: warning: unmappable character for encoding ASCII
[javac] * may be ???nondownloadable??? certificates, about which the responder must provide
[javac] ^
[javac] /build/buildd/bouncycastle-1.39/build/artifacts/jdk1.4/bcprov-jdk14-139/src/org/bouncycastle/asn1/isismtt/ocsp/RequestedCertificate.java:22: warning: unmappable character for encoding ASCII
[javac] * may be ???nondownloadable??? certificates, about which the responder must provide
[javac] ^
[javac] /build/buildd/bouncycastle-1.39/build/artifacts/jdk1.4/bcprov-jdk14-139/src/org/bouncycastle/asn1/isismtt/ocsp/RequestedCertificate.java:22: warning: unmappable character for encoding ASCII
[javac] * may be ???nondownloadable??? certificates, about which the responder must provide
[javac] ^
[javac] /build/buildd/bouncycastle-1.39/build/artifacts/jdk1.4/bcprov-jdk14-139/src/org/bouncycastle/asn1/isismtt/ocsp/RequestedCertificate.java:22: warning: unmappable character for encoding ASCII
[javac] * may be ???nondownloadable??? certificates, about which the responder must provide
[javac] ^
[javac] /build/buildd/bouncycastle-1.39/build/artifacts/jdk1.4/bcprov-jdk14-139/src/org/bouncycastle/asn1/isismtt/ocsp/RequestedCertificate.java:22: warning: unmappable character for encoding ASCII
[javac] * may be ???nondownloadable??? certificates, about which the responder must provide
[javac] ^
[javac] /build/buildd/bouncycastle-1.39/build/artifacts/jdk1.4/bcprov-jdk14-139/src/org/bouncycastle/asn1/isismtt/ocsp/RequestedCertificate.java:22: warning: unmappable character for encoding ASCII
[javac] * may be ???nondownloadable??? certificates, about which the responder must provide
[javac] ^
[javac] /build/buildd/bouncycastle-1.39/build/artifacts/jdk1.4/bcprov-jdk14-139/src/org/bouncycastle/asn1/isismtt/x509/AdmissionSyntax.java:66: warning: unmappable character for encoding ASCII
[javac] * ???officially??? registered professions (text and possibly OID) as well as
[javac] ^
[javac] /build/buildd/bouncycastle-1.39/build/artifacts/jdk1.4/bcprov-jdk14-139/src/org/bouncycastle/asn1/isismtt/x509/AdmissionSyntax.java:66: warning: unmappable character for encoding ASCII
[javac] * ???officially??? registered professions (text and possibly OID) as well as
[javac] ^
[javac] /build/buildd/bouncycastle-1.39/build/artifacts/jdk1.4/bcprov-jdk14-139/src/org/bouncycastle/asn1/isismtt/x509/AdmissionSyntax.java:66: warning: unmappable character for encoding ASCII
[javac] * ???officially??? registered professions (text and possibly OID) as well as
[javac] ^
[javac] /build/buildd/bouncycastle-1.39/build/artifacts/jdk1.4/bcprov-jdk14-139/src/org/bouncycastle/asn1/isismtt/x509/AdmissionSyntax.java:66: warning: unmappable character for encoding ASCII
[javac] * ???officially??? registered professions (text and possibly OID) as well as
[javac] ^
[javac] /build/buildd/bouncycastle-1.39/build/artifacts/jdk1.4/bcprov-jdk14-139/src/org/bouncycastle/asn1/isismtt/x509/AdmissionSyntax.java:66: warning: unmappable character for encoding ASCII
[javac] * ???officially??? registered professions (text and possibly OID) as well as
[javac] ^
[javac] /build/buildd/bouncycastle-1.39/build/artifacts/jdk1.4/bcprov-jdk14-139/src/org/bouncycastle/asn1/isismtt/x509/AdmissionSyntax.java:66: warning: unmappable character for encoding ASCII
[javac] * ???officially??? registered professions (text and possibly OID) as well as
[javac] ^
[javac] /build/buildd/bouncycastle-1.39/build/artifacts/jdk1.4/bcprov-jdk14-139/src/org/bouncycastle/asn1/isismtt/x509/MonetaryLimit.java:36: warning: unmappable character for encoding ASCII
[javac] * value = amount???10*exponent
[javac] ^
[javac] /build/buildd/bouncycastle-1.39/build/artifacts/jdk1.4/bcprov-jdk14-139/src/org/bouncycastle/asn1/isismtt/x509/MonetaryLimit.java:36: warning: unmappable character for encoding ASCII
[javac] * value = amount???10*exponent
[javac] ^
[javac] /build/buildd/bouncycastle-1.39/build/artifacts/jdk1.4/bcprov-jdk14-139/src/org/bouncycastle/asn1/isismtt/x509/MonetaryLimit.java:36: warning: unmappable character for encoding ASCII
[javac] * value = amount???10*exponent
[javac] ^
[javac] /build/buildd/bouncycastle-1.39/build/artifacts/jdk1.4/bcprov-jdk14-139/src/org/bouncycastle/asn1/isismtt/x509/MonetaryLimit.java:77: warning: unmappable character for encoding ASCII
[javac] * value = amount???10^exponent
[javac] ^
[javac] /build/buildd/bouncycastle-1.39/build/artifacts/jdk1.4/bcprov-jdk14-139/src/org/bouncycastle/asn1/isismtt/x509/MonetaryLimit.java:77: warning: unmappable character for encoding ASCII
[javac] * value = amount???10^exponent
[javac] ^
[javac] /build/buildd/bouncycastle-1.39/build/artifacts/jdk1.4/bcprov-jdk14-139/src/org/bouncycastle/asn1/isismtt/x509/MonetaryLimit.java:77: warning: unmappable character for encoding ASCII
[javac] * value = amount???10^exponent
[javac] ^
[javac] /build/buildd/bouncycastle-1.39/build/artifacts/jdk1.4/bcprov-jdk14-139/src/org/bouncycastle/asn1/isismtt/x509/NamingAuthority.java:40: warning: unmappable character for encoding ASCII
[javac] * ???Recht, Wirtschaft, Steuern??? (???Law, Economy, Taxes???) is registered as the
[javac] ^
[javac] /build/buildd/bouncycastle-1.39/build/artifacts/jdk1.4/bcprov-jdk14-139/src/org/bouncycastle/asn1/isismtt/x509/NamingAuthority.java:40: warning: unmappable character for encoding ASCII
[javac] * ???Recht, Wirtschaft, Steuern??? (???Law, Economy, Taxes???) is registered as the
[javac] ^
[javac] /build/buildd/bouncycastle-1.39/build/artifacts/jdk1.4/bcprov-jdk14-139/src/org/bouncycastle/asn1/isismtt/x509/NamingAuthority.java:40: warning: unmappable character for encoding ASCII
[javac] * ???Recht, Wirtschaft, Steuern??? (???Law, Economy, Taxes???) is registered as the
[javac] ^
[javac] /build/buildd/bouncycastle-1.39/build/artifacts/jdk1.4/bcprov-jdk14-139/src/org/bouncycastle/asn1/isismtt/x509/NamingAuthority.java:40: warning: unmappable character for encoding ASCII
[javac] * ???Recht, Wirtschaft, Steuern??? (???Law, Economy, Taxes???) is registered as the
[javac] ^
[javac] /build/buildd/bouncycastle-1.39/build/artifacts/jdk1.4/bcprov-jdk14-139/src/org/bouncycastle/asn1/isismtt/x509/NamingAuthority.java:40: warning: unmappable character for encoding ASCII
[javac] * ???Recht, Wirtschaft, Steuern??? (???Law, Economy, Taxes???) is registered as the
[javac] ^
[javac] /build/buildd/bouncycastle-1.39/build/artifacts/jdk1.4/bcprov-jdk14-139/src/org/bouncycastle/asn1/isismtt/x509/NamingAuthority.java:40: warning: unmappable character for encoding ASCII
[javac] * ???Recht, Wirtschaft, Steuern??? (???Law, Economy, Taxes???) is registered as the
[javac] ^
[javac] /build/buildd/bouncycastle-1.39/build/artifacts/jdk1.4/bcprov-jdk14-139/src/org/bouncycastle/asn1/isismtt/x509/NamingAuthority.java:40: warning: unmappable character for encoding ASCII
[javac] * ???Recht, Wirtschaft, Steuern??? (???Law, Economy, Taxes???) is registered as the
[javac] ^
[javac] /build/buildd/bouncycastle-1.39/build/artifacts/jdk1.4/bcprov-jdk14-139/src/org/bouncycastle/asn1/isismtt/x509/NamingAuthority.java:40: warning: unmappable character for encoding ASCII
[javac] * ???Recht, Wirtschaft, Steuern??? (???Law, Economy, Taxes???) is registered as the
[javac] ^
[javac] /build/buildd/bouncycastle-1.39/build/artifacts/jdk1.4/bcprov-jdk14-139/src/org/bouncycastle/asn1/isismtt/x509/NamingAuthority.java:40: warning: unmappable character for encoding ASCII
[javac] * ???Recht, Wirtschaft, Steuern??? (???Law, Economy, Taxes???) is registered as the
[javac] ^
[javac] /build/buildd/bouncycastle-1.39/build/artifacts/jdk1.4/bcprov-jdk14-139/src/org/bouncycastle/asn1/isismtt/x509/NamingAuthority.java:40: warning: unmappable character for encoding ASCII
[javac] * ???Recht, Wirtschaft, Steuern??? (???Law, Economy, Taxes???) is registered as the
[javac] ^
[javac] /build/buildd/bouncycastle-1.39/build/artifacts/jdk1.4/bcprov-jdk14-139/src/org/bouncycastle/asn1/isismtt/x509/NamingAuthority.java:40: warning: unmappable character for encoding ASCII
[javac] * ???Recht, Wirtschaft, Steuern??? (???Law, Economy, Taxes???) is registered as the
[javac] ^
[javac] /build/buildd/bouncycastle-1.39/build/artifacts/jdk1.4/bcprov-jdk14-139/src/org/bouncycastle/asn1/isismtt/x509/NamingAuthority.java:40: warning: unmappable character for encoding ASCII
[javac] * ???Recht, Wirtschaft, Steuern??? (???Law, Economy, Taxes???) is registered as the
[javac] ^
[javac] /build/buildd/bouncycastle-1.39/build/artifacts/jdk1.4/bcprov-jdk14-139/src/org/bouncycastle/asn1/isismtt/x509/ProfessionInfo.java:39: warning: unmappable character for encoding ASCII
[javac] * Rechtsanw???ltin
[javac] ^
[javac] /build/buildd/bouncycastle-1.39/build/artifacts/jdk1.4/bcprov-jdk14-139/src/org/bouncycastle/asn1/isismtt/x509/ProfessionInfo.java:39: warning: unmappable character for encoding ASCII
[javac] * Rechtsanw???ltin
[javac] ^
[javac] /build/buildd/bouncycastle-1.39/build/artifacts/jdk1.4/bcprov-jdk14-139/src/org/bouncycastle/asn1/isismtt/x509/ProfessionInfo.java:39: warning: unmappable character for encoding ASCII
[javac] * Rechtsanw???ltin
[javac] ^
[javac] /build/buildd/bouncycastle-1.39/build/artifacts/jdk1.4/bcprov-jdk14-139/src/org/bouncycastle/asn1/isismtt/x509/ProfessionInfo.java:69: warning: unmappable character for encoding ASCII
[javac] * Steuerbevollm???chtigte
[javac] ^
[javac] /build/buildd/bouncycastle-1.39/build/artifacts/jdk1.4/bcprov-jdk14-139/src/org/bouncycastle/asn1/isismtt/x509/ProfessionInfo.java:69: warning: unmappable character for encoding ASCII
[javac] * Steuerbevollm???chtigte
[javac] ^
[javac] /build/buildd/bouncycastle-1.39/build/artifacts/jdk1.4/bcprov-jdk14-139/src/org/bouncycastle/asn1/isismtt/x509/ProfessionInfo.java:69: warning: unmappable character for encoding ASCII
[javac] * Steuerbevollm???chtigte
[javac] ^
[javac] /build/buildd/bouncycastle-1.39/build/artifacts/jdk1.4/bcprov-jdk14-139/src/org/bouncycastle/asn1/isismtt/x509/ProfessionInfo.java:75: warning: unmappable character for encoding ASCII
[javac] * Steuerbevollm???chtigter
[javac] ^
[javac] /build/buildd/bouncycastle-1.39/build/artifacts/jdk1.4/bcprov-jdk14-139/src/org/bouncycastle/asn1/isismtt/x509/ProfessionInfo.java:75: warning: unmappable character for encoding ASCII
[javac] * Steuerbevollm???chtigter
[javac] ^
[javac] /build/buildd/bouncycastle-1.39/build/artifacts/jdk1.4/bcprov-jdk14-139/src/org/bouncycastle/asn1/isismtt/x509/ProfessionInfo.java:75: warning: unmappable character for encoding ASCII
[javac] * Steuerbevollm???chtigter
[javac] ^
[javac] /build/buildd/bouncycastle-1.39/build/artifacts/jdk1.4/bcprov-jdk14-139/src/org/bouncycastle/asn1/isismtt/x509/ProfessionInfo.java:117: warning: unmappable character for encoding ASCII
[javac] * Wirtschaftspr???ferin
[javac] ^
[javac] /build/buildd/bouncycastle-1.39/build/artifacts/jdk1.4/bcprov-jdk14-139/src/org/bouncycastle/asn1/isismtt/x509/ProfessionInfo.java:117: warning: unmappable character for encoding ASCII
[javac] * Wirtschaftspr???ferin
[javac] ^
[javac] /build/buildd/bouncycastle-1.39/build/artifacts/jdk1.4/bcprov-jdk14-139/src/org/bouncycastle/asn1/isismtt/x509/ProfessionInfo.java:117: warning: unmappable character for encoding ASCII
[javac] * Wirtschaftspr???ferin
[javac] ^
[javac] /build/buildd/bouncycastle-1.39/build/artifacts/jdk1.4/bcprov-jdk14-139/src/org/bouncycastle/asn1/isismtt/x509/ProfessionInfo.java:123: warning: unmappable character for encoding ASCII
[javac] * Wirtschaftspr???fer
[javac] ^
[javac] /build/buildd/bouncycastle-1.39/build/artifacts/jdk1.4/bcprov-jdk14-139/src/org/bouncycastle/asn1/isismtt/x509/ProfessionInfo.java:123: warning: unmappable character for encoding ASCII
[javac] * Wirtschaftspr???fer
[javac] ^
[javac] /build/buildd/bouncycastle-1.39/build/artifacts/jdk1.4/bcprov-jdk14-139/src/org/bouncycastle/asn1/isismtt/x509/ProfessionInfo.java:123: warning: unmappable character for encoding ASCII
[javac] * Wirtschaftspr???fer
[javac] ^
[javac] /build/buildd/bouncycastle-1.39/build/artifacts/jdk1.4/bcprov-jdk14-139/src/org/bouncycastle/asn1/isismtt/x509/ProfessionInfo.java:129: warning: unmappable character for encoding ASCII
[javac] * Vereidigte Buchpr???ferin
[javac] ^
[javac] /build/buildd/bouncycastle-1.39/build/artifacts/jdk1.4/bcprov-jdk14-139/src/org/bouncycastle/asn1/isismtt/x509/ProfessionInfo.java:129: warning: unmappable character for encoding ASCII
[javac] * Vereidigte Buchpr???ferin
[javac] ^
[javac] /build/buildd/bouncycastle-1.39/build/artifacts/jdk1.4/bcprov-jdk14-139/src/org/bouncycastle/asn1/isismtt/x509/ProfessionInfo.java:129: warning: unmappable character for encoding ASCII
[javac] * Vereidigte Buchpr???ferin
[javac] ^
[javac] /build/buildd/bouncycastle-1.39/build/artifacts/jdk1.4/bcprov-jdk14-139/src/org/bouncycastle/asn1/isismtt/x509/ProfessionInfo.java:135: warning: unmappable character for encoding ASCII
[javac] * Vereidigter Buchpr???fer
[javac] ^
[javac] /build/buildd/bouncycastle-1.39/build/artifacts/jdk1.4/bcprov-jdk14-139/src/org/bouncycastle/asn1/isismtt/x509/ProfessionInfo.java:135: warning: unmappable character for encoding ASCII
[javac] * Vereidigter Buchpr???fer
[javac] ^
[javac] /build/buildd/bouncycastle-1.39/build/artifacts/jdk1.4/bcprov-jdk14-139/src/org/bouncycastle/asn1/isismtt/x509/ProfessionInfo.java:135: warning: unmappable character for encoding ASCII
[javac] * Vereidigter Buchpr???fer
[javac] ^
[javac] /build/buildd/bouncycastle-1.39/build/artifacts/jdk1.4/bcprov-jdk14-139/src/org/bouncycastle/asn1/isismtt/x509/ProfessionInfo.java:141: warning: unmappable character for encoding ASCII
[javac] * Patentanw???ltin
[javac] ^
[javac] /build/buildd/bouncycastle-1.39/build/artifacts/jdk1.4/bcprov-jdk14-139/src/org/bouncycastle/asn1/isismtt/x509/ProfessionInfo.java:141: warning: unmappable character for encoding ASCII
[javac] * Patentanw???ltin
[javac] ^
[javac] /build/buildd/bouncycastle-1.39/build/artifacts/jdk1.4/bcprov-jdk14-139/src/org/bouncycastle/asn1/isismtt/x509/ProfessionInfo.java:141: warning: unmappable character for encoding ASCII
[javac] * Patentanw???ltin
[javac] ^
[javac] /build/buildd/bouncycastle-1.39/build/artifacts/jdk1.4/bcprov-jdk14-139/src/org/bouncycastle/jce/provider/PKIXCertPathValidatorSpi.java:30: warning: unmappable character for encoding ASCII
[javac] * CertPathValidatorSpi implementation for X.509 Certificate validation ??? la RFC
[javac] ^
[javac] /build/buildd/bouncycastle-1.39/build/artifacts/jdk1.4/bcprov-jdk14-139/src/org/bouncycastle/jce/provider/PKIXCertPathValidatorSpi.java:30: warning: unmappable character for encoding ASCII
[javac] * CertPathValidatorSpi implementation for X.509 Certificate validation ??? la RFC
[javac] ^
[javac] /build/buildd/bouncycastle-1.39/build/artifacts/jdk1.4/bcprov-jdk14-139/src/org/bouncycastle/jce/provider/PKIXCertPathValidatorSpi.java:30: warning: unmappable character for encoding ASCII
[javac] * CertPathValidatorSpi implementation for X.509 Certificate validation ??? la RFC
[javac] ^
[javac] /build/buildd/bouncycastle-1.39/build/artifacts/jdk1.4/bcprov-jdk14-139/src/org/bouncycastle/math/ec/ECAlgorithms.java:33: warning: unmappable character for encoding ASCII
[javac] * 71(7):806???808, Aug./Sept. 1964)
[javac] ^
[javac] /build/buildd/bouncycastle-1.39/build/artifacts/jdk1.4/bcprov-jdk14-139/src/org/bouncycastle/math/ec/ECAlgorithms.java:33: warning: unmappable character for encoding ASCII
[javac] * 71(7):806???808, Aug./Sept. 1964)
[javac] ^
[javac] /build/buildd/bouncycastle-1.39/build/artifacts/jdk1.4/bcprov-jdk14-139/src/org/bouncycastle/math/ec/ECAlgorithms.java:33: warning: unmappable character for encoding ASCII
[javac] * 71(7):806???808, Aug./Sept. 1964)
[javac] ^
[javac] Note: Some input files use or override a deprecated API.
[javac] Note: Recompile with -Xlint:deprecation for details.
[javac] Note: Some input files use unchecked or unsafe operations.
[javac] Note: Recompile with -Xlint:unchecked for details.
[javac] 68 warnings
[copy] Copying 2 files to /build/buildd/bouncycastle-1.39/build/bcprov-jdk14-139/classes
[jar] Building jar: /build/buildd/bouncycastle-1.39/build/artifacts/jdk1.4/jars/bcprov-jdk14-139.jar
javadoc-provider:
[copy] Copying 67 files to /build/buildd/bouncycastle-1.39/build/artifacts/jdk1.4/bcprov-jdk14-139/src
[mkdir] Created dir: /build/buildd/bouncycastle-1.39/build/artifacts/jdk1.4/javadoc/bcprov
[javadoc] Generating Javadoc
[javadoc] Javadoc execution
[javadoc] Loading source files for package org.bouncycastle.asn1...
[javadoc] Loading source files for package org.bouncycastle.asn1.cmp...
[javadoc] Loading source files for package org.bouncycastle.asn1.cms...
[javadoc] Loading source files for package org.bouncycastle.asn1.crmf...
[javadoc] Loading source files for package org.bouncycastle.asn1.cryptopro...
[javadoc] Loading source files for package org.bouncycastle.asn1.esf...
[javadoc] Loading source files for package org.bouncycastle.asn1.ess...
[javadoc] Loading source files for package org.bouncycastle.asn1.gnu...
[javadoc] /build/buildd/bouncycastle-1.39/build/artifacts/jdk1.4/bcprov-jdk14-139/src/org/bouncycastle/asn1/gnu/GNUObjectIdentifiers.java:8: warning: unmappable character for encoding ASCII
[javadoc] public static final DERObjectIdentifier GnuPG = new DERObjectIdentifier("1.3.6.1.4.1.11591.2"); // GnuPG (??gypten)
[javadoc] ^
[javadoc] /build/buildd/bouncycastle-1.39/build/artifacts/jdk1.4/bcprov-jdk14-139/src/org/bouncycastle/asn1/gnu/GNUObjectIdentifiers.java:8: warning: unmappable character for encoding ASCII
[javadoc] public static final DERObjectIdentifier GnuPG = new DERObjectIdentifier("1.3.6.1.4.1.11591.2"); // GnuPG (??gypten)
[javadoc] ^
[javadoc] Loading source files for package org.bouncycastle.asn1.iana...
[javadoc] Loading source files for package org.bouncycastle.asn1.icao...
[javadoc] Loading source files for package org.bouncycastle.asn1.isismtt...
[javadoc] /build/buildd/bouncycastle-1.39/build/artifacts/jdk1.4/bcprov-jdk14-139/src/org/bouncycastle/asn1/isismtt/ISISMTTObjectIdentifiers.java:72: warning: unmappable character for encoding ASCII
[javadoc] * certificate and that is used as ???security anchor???.
[javadoc] ^
[javadoc] /build/buildd/bouncycastle-1.39/build/artifacts/jdk1.4/bcprov-jdk14-139/src/org/bouncycastle/asn1/isismtt/ISISMTTObjectIdentifiers.java:72: warning: unmappable character for encoding ASCII
[javadoc] * certificate and that is used as ???security anchor???.
[javadoc] ^
[javadoc] /build/buildd/bouncycastle-1.39/build/artifacts/jdk1.4/bcprov-jdk14-139/src/org/bouncycastle/asn1/isismtt/ISISMTTObjectIdentifiers.java:72: warning: unmappable character for encoding ASCII
[javadoc] * certificate and that is used as ???security anchor???.
[javadoc] ^
[javadoc] /build/buildd/bouncycastle-1.39/build/artifacts/jdk1.4/bcprov-jdk14-139/src/org/bouncycastle/asn1/isismtt/ISISMTTObjectIdentifiers.java:72: warning: unmappable character for encoding ASCII
[javadoc] * certificate and that is used as ???security anchor???.
[javadoc] ^
[javadoc] /build/buildd/bouncycastle-1.39/build/artifacts/jdk1.4/bcprov-jdk14-139/src/org/bouncycastle/asn1/isismtt/ISISMTTObjectIdentifiers.java:72: warning: unmappable character for encoding ASCII
[javadoc] * certificate and that is used as ???security anchor???.
[javadoc] ^
[javadoc] /build/buildd/bouncycastle-1.39/build/artifacts/jdk1.4/bcprov-jdk14-139/src/org/bouncycastle/asn1/isismtt/ISISMTTObjectIdentifiers.java:72: warning: unmappable character for encoding ASCII
[javadoc] * certificate and that is used as ???security anchor???.
[javadoc] ^
[javadoc] Loading source files for package org.bouncycastle.asn1.isismtt.ocsp...
[javadoc] /build/buildd/bouncycastle-1.39/build/artifacts/jdk1.4/bcprov-jdk14-139/src/org/bouncycastle/asn1/isismtt/ocsp/RequestedCertificate.java:22: warning: unmappable character for encoding ASCII
[javadoc] * may be ???nondownloadable??? certificates, about which the responder must provide
[javadoc] ^
[javadoc] /build/buildd/bouncycastle-1.39/build/artifacts/jdk1.4/bcprov-jdk14-139/src/org/bouncycastle/asn1/isismtt/ocsp/RequestedCertificate.java:22: warning: unmappable character for encoding ASCII
[javadoc] * may be ???nondownloadable??? certificates, about which the responder must provide
[javadoc] ^
[javadoc] /build/buildd/bouncycastle-1.39/build/artifacts/jdk1.4/bcprov-jdk14-139/src/org/bouncycastle/asn1/isismtt/ocsp/RequestedCertificate.java:22: warning: unmappable character for encoding ASCII
[javadoc] * may be ???nondownloadable??? certificates, about which the responder must provide
[javadoc] ^
[javadoc] /build/buildd/bouncycastle-1.39/build/artifacts/jdk1.4/bcprov-jdk14-139/src/org/bouncycastle/asn1/isismtt/ocsp/RequestedCertificate.java:22: warning: unmappable character for encoding ASCII
[javadoc] * may be ???nondownloadable??? certificates, about which the responder must provide
[javadoc] ^
[javadoc] /build/buildd/bouncycastle-1.39/build/artifacts/jdk1.4/bcprov-jdk14-139/src/org/bouncycastle/asn1/isismtt/ocsp/RequestedCertificate.java:22: warning: unmappable character for encoding ASCII
[javadoc] * may be ???nondownloadable??? certificates, about which the responder must provide
[javadoc] ^
[javadoc] /build/buildd/bouncycastle-1.39/build/artifacts/jdk1.4/bcprov-jdk14-139/src/org/bouncycastle/asn1/isismtt/ocsp/RequestedCertificate.java:22: warning: unmappable character for encoding ASCII
[javadoc] * may be ???nondownloadable??? certificates, about which the responder must provide
[javadoc] ^
[javadoc] Loading source files for package org.bouncycastle.asn1.isismtt.x509...
[javadoc] /build/buildd/bouncycastle-1.39/build/artifacts/jdk1.4/bcprov-jdk14-139/src/org/bouncycastle/asn1/isismtt/x509/AdmissionSyntax.java:66: warning: unmappable character for encoding ASCII
[javadoc] * ???officially??? registered professions (text and possibly OID) as well as
[javadoc] ^
[javadoc] /build/buildd/bouncycastle-1.39/build/artifacts/jdk1.4/bcprov-jdk14-139/src/org/bouncycastle/asn1/isismtt/x509/AdmissionSyntax.java:66: warning: unmappable character for encoding ASCII
[javadoc] * ???officially??? registered professions (text and possibly OID) as well as
[javadoc] ^
[javadoc] /build/buildd/bouncycastle-1.39/build/artifacts/jdk1.4/bcprov-jdk14-139/src/org/bouncycastle/asn1/isismtt/x509/AdmissionSyntax.java:66: warning: unmappable character for encoding ASCII
[javadoc] * ???officially??? registered professions (text and possibly OID) as well as
[javadoc] ^
[javadoc] /build/buildd/bouncycastle-1.39/build/artifacts/jdk1.4/bcprov-jdk14-139/src/org/bouncycastle/asn1/isismtt/x509/AdmissionSyntax.java:66: warning: unmappable character for encoding ASCII
[javadoc] * ???officially??? registered professions (text and possibly OID) as well as
[javadoc] ^
[javadoc] /build/buildd/bouncycastle-1.39/build/artifacts/jdk1.4/bcprov-jdk14-139/src/org/bouncycastle/asn1/isismtt/x509/AdmissionSyntax.java:66: warning: unmappable character for encoding ASCII
[javadoc] * ???officially??? registered professions (text and possibly OID) as well as
[javadoc] ^
[javadoc] /build/buildd/bouncycastle-1.39/build/artifacts/jdk1.4/bcprov-jdk14-139/src/org/bouncycastle/asn1/isismtt/x509/AdmissionSyntax.java:66: warning: unmappable character for encoding ASCII
[javadoc] * ???officially??? registered professions (text and possibly OID) as well as
[javadoc] ^
[javadoc] /build/buildd/bouncycastle-1.39/build/artifacts/jdk1.4/bcprov-jdk14-139/src/org/bouncycastle/asn1/isismtt/x509/NamingAuthority.java:40: warning: unmappable character for encoding ASCII
[javadoc] * ???Recht, Wirtschaft, Steuern??? (???Law, Economy, Taxes???) is registered as the
[javadoc] ^
[javadoc] /build/buildd/bouncycastle-1.39/build/artifacts/jdk1.4/bcprov-jdk14-139/src/org/bouncycastle/asn1/isismtt/x509/NamingAuthority.java:40: warning: unmappable character for encoding ASCII
[javadoc] * ???Recht, Wirtschaft, Steuern??? (???Law, Economy, Taxes???) is registered as the
[javadoc] ^
[javadoc] /build/buildd/bouncycastle-1.39/build/artifacts/jdk1.4/bcprov-jdk14-139/src/org/bouncycastle/asn1/isismtt/x509/NamingAuthority.java:40: warning: unmappable character for encoding ASCII
[javadoc] * ???Recht, Wirtschaft, Steuern??? (???Law, Economy, Taxes???) is registered as the
[javadoc] ^
[javadoc] /build/buildd/bouncycastle-1.39/build/artifacts/jdk1.4/bcprov-jdk14-139/src/org/bouncycastle/asn1/isismtt/x509/NamingAuthority.java:40: warning: unmappable character for encoding ASCII
[javadoc] * ???Recht, Wirtschaft, Steuern??? (???Law, Economy, Taxes???) is registered as the
[javadoc] ^
[javadoc] /build/buildd/bouncycastle-1.39/build/artifacts/jdk1.4/bcprov-jdk14-139/src/org/bouncycastle/asn1/isismtt/x509/NamingAuthority.java:40: warning: unmappable character for encoding ASCII
[javadoc] * ???Recht, Wirtschaft, Steuern??? (???Law, Economy, Taxes???) is registered as the
[javadoc] ^
[javadoc] /build/buildd/bouncycastle-1.39/build/artifacts/jdk1.4/bcprov-jdk14-139/src/org/bouncycastle/asn1/isismtt/x509/NamingAuthority.java:40: warning: unmappable character for encoding ASCII
[javadoc] * ???Recht, Wirtschaft, Steuern??? (???Law, Economy, Taxes???) is registered as the
[javadoc] ^
[javadoc] /build/buildd/bouncycastle-1.39/build/artifacts/jdk1.4/bcprov-jdk14-139/src/org/bouncycastle/asn1/isismtt/x509/NamingAuthority.java:40: warning: unmappable character for encoding ASCII
[javadoc] * ???Recht, Wirtschaft, Steuern??? (???Law, Economy, Taxes???) is registered as the
[javadoc] ^
[javadoc] /build/buildd/bouncycastle-1.39/build/artifacts/jdk1.4/bcprov-jdk14-139/src/org/bouncycastle/asn1/isismtt/x509/NamingAuthority.java:40: warning: unmappable character for encoding ASCII
[javadoc] * ???Recht, Wirtschaft, Steuern??? (???Law, Economy, Taxes???) is registered as the
[javadoc] ^
[javadoc] /build/buildd/bouncycastle-1.39/build/artifacts/jdk1.4/bcprov-jdk14-139/src/org/bouncycastle/asn1/isismtt/x509/NamingAuthority.java:40: warning: unmappable character for encoding ASCII
[javadoc] * ???Recht, Wirtschaft, Steuern??? (???Law, Economy, Taxes???) is registered as the
[javadoc] ^
[javadoc] /build/buildd/bouncycastle-1.39/build/artifacts/jdk1.4/bcprov-jdk14-139/src/org/bouncycastle/asn1/isismtt/x509/NamingAuthority.java:40: warning: unmappable character for encoding ASCII
[javadoc] * ???Recht, Wirtschaft, Steuern??? (???Law, Economy, Taxes???) is registered as the
[javadoc] ^
[javadoc] /build/buildd/bouncycastle-1.39/build/artifacts/jdk1.4/bcprov-jdk14-139/src/org/bouncycastle/asn1/isismtt/x509/NamingAuthority.java:40: warning: unmappable character for encoding ASCII
[javadoc] * ???Recht, Wirtschaft, Steuern??? (???Law, Economy, Taxes???) is registered as the
[javadoc] ^
[javadoc] /build/buildd/bouncycastle-1.39/build/artifacts/jdk1.4/bcprov-jdk14-139/src/org/bouncycastle/asn1/isismtt/x509/NamingAuthority.java:40: warning: unmappable character for encoding ASCII
[javadoc] * ???Recht, Wirtschaft, Steuern??? (???Law, Economy, Taxes???) is registered as the
[javadoc] ^
[javadoc] /build/buildd/bouncycastle-1.39/build/artifacts/jdk1.4/bcprov-jdk14-139/src/org/bouncycastle/asn1/isismtt/x509/ProfessionInfo.java:39: warning: unmappable character for encoding ASCII
[javadoc] * Rechtsanw???ltin
[javadoc] ^
[javadoc] /build/buildd/bouncycastle-1.39/build/artifacts/jdk1.4/bcprov-jdk14-139/src/org/bouncycastle/asn1/isismtt/x509/ProfessionInfo.java:39: warning: unmappable character for encoding ASCII
[javadoc] * Rechtsanw???ltin
[javadoc] ^
[javadoc] /build/buildd/bouncycastle-1.39/build/artifacts/jdk1.4/bcprov-jdk14-139/src/org/bouncycastle/asn1/isismtt/x509/ProfessionInfo.java:39: warning: unmappable character for encoding ASCII
[javadoc] * Rechtsanw???ltin
[javadoc] ^
[javadoc] /build/buildd/bouncycastle-1.39/build/artifacts/jdk1.4/bcprov-jdk14-139/src/org/bouncycastle/asn1/isismtt/x509/ProfessionInfo.java:69: warning: unmappable character for encoding ASCII
[javadoc] * Steuerbevollm???chtigte
[javadoc] ^
[javadoc] /build/buildd/bouncycastle-1.39/build/artifacts/jdk1.4/bcprov-jdk14-139/src/org/bouncycastle/asn1/isismtt/x509/ProfessionInfo.java:69: warning: unmappable character for encoding ASCII
[javadoc] * Steuerbevollm???chtigte
[javadoc] ^
[javadoc] /build/buildd/bouncycastle-1.39/build/artifacts/jdk1.4/bcprov-jdk14-139/src/org/bouncycastle/asn1/isismtt/x509/ProfessionInfo.java:69: warning: unmappable character for encoding ASCII
[javadoc] * Steuerbevollm???chtigte
[javadoc] ^
[javadoc] /build/buildd/bouncycastle-1.39/build/artifacts/jdk1.4/bcprov-jdk14-139/src/org/bouncycastle/asn1/isismtt/x509/ProfessionInfo.java:75: warning: unmappable character for encoding ASCII
[javadoc] * Steuerbevollm???chtigter
[javadoc] ^
[javadoc] /build/buildd/bouncycastle-1.39/build/artifacts/jdk1.4/bcprov-jdk14-139/src/org/bouncycastle/asn1/isismtt/x509/ProfessionInfo.java:75: warning: unmappable character for encoding ASCII
[javadoc] * Steuerbevollm???chtigter
[javadoc] ^
[javadoc] /build/buildd/bouncycastle-1.39/build/artifacts/jdk1.4/bcprov-jdk14-139/src/org/bouncycastle/asn1/isismtt/x509/ProfessionInfo.java:75: warning: unmappable character for encoding ASCII
[javadoc] * Steuerbevollm???chtigter
[javadoc] ^
[javadoc] /build/buildd/bouncycastle-1.39/build/artifacts/jdk1.4/bcprov-jdk14-139/src/org/bouncycastle/asn1/isismtt/x509/ProfessionInfo.java:117: warning: unmappable character for encoding ASCII
[javadoc] * Wirtschaftspr???ferin
[javadoc] ^
[javadoc] /build/buildd/bouncycastle-1.39/build/artifacts/jdk1.4/bcprov-jdk14-139/src/org/bouncycastle/asn1/isismtt/x509/ProfessionInfo.java:117: warning: unmappable character for encoding ASCII
[javadoc] * Wirtschaftspr???ferin
[javadoc] ^
[javadoc] /build/buildd/bouncycastle-1.39/build/artifacts/jdk1.4/bcprov-jdk14-139/src/org/bouncycastle/asn1/isismtt/x509/ProfessionInfo.java:117: warning: unmappable character for encoding ASCII
[javadoc] * Wirtschaftspr???ferin
[javadoc] ^
[javadoc] /build/buildd/bouncycastle-1.39/build/artifacts/jdk1.4/bcprov-jdk14-139/src/org/bouncycastle/asn1/isismtt/x509/ProfessionInfo.java:123: warning: unmappable character for encoding ASCII
[javadoc] * Wirtschaftspr???fer
[javadoc] ^
[javadoc] /build/buildd/bouncycastle-1.39/build/artifacts/jdk1.4/bcprov-jdk14-139/src/org/bouncycastle/asn1/isismtt/x509/ProfessionInfo.java:123: warning: unmappable character for encoding ASCII
[javadoc] * Wirtschaftspr???fer
[javadoc] ^
[javadoc] /build/buildd/bouncycastle-1.39/build/artifacts/jdk1.4/bcprov-jdk14-139/src/org/bouncycastle/asn1/isismtt/x509/ProfessionInfo.java:123: warning: unmappable character for encoding ASCII
[javadoc] * Wirtschaftspr???fer
[javadoc] ^
[javadoc] /build/buildd/bouncycastle-1.39/build/artifacts/jdk1.4/bcprov-jdk14-139/src/org/bouncycastle/asn1/isismtt/x509/ProfessionInfo.java:129: warning: unmappable character for encoding ASCII
[javadoc] * Vereidigte Buchpr???ferin
[javadoc] ^
[javadoc] /build/buildd/bouncycastle-1.39/build/artifacts/jdk1.4/bcprov-jdk14-139/src/org/bouncycastle/asn1/isismtt/x509/ProfessionInfo.java:129: warning: unmappable character for encoding ASCII
[javadoc] * Vereidigte Buchpr???ferin
[javadoc] ^
[javadoc] /build/buildd/bouncycastle-1.39/build/artifacts/jdk1.4/bcprov-jdk14-139/src/org/bouncycastle/asn1/isismtt/x509/ProfessionInfo.java:129: warning: unmappable character for encoding ASCII
[javadoc] * Vereidigte Buchpr???ferin
[javadoc] ^
[javadoc] /build/buildd/bouncycastle-1.39/build/artifacts/jdk1.4/bcprov-jdk14-139/src/org/bouncycastle/asn1/isismtt/x509/ProfessionInfo.java:135: warning: unmappable character for encoding ASCII
[javadoc] * Vereidigter Buchpr???fer
[javadoc] ^
[javadoc] /build/buildd/bouncycastle-1.39/build/artifacts/jdk1.4/bcprov-jdk14-139/src/org/bouncycastle/asn1/isismtt/x509/ProfessionInfo.java:135: warning: unmappable character for encoding ASCII
[javadoc] * Vereidigter Buchpr???fer
[javadoc] ^
[javadoc] /build/buildd/bouncycastle-1.39/build/artifacts/jdk1.4/bcprov-jdk14-139/src/org/bouncycastle/asn1/isismtt/x509/ProfessionInfo.java:135: warning: unmappable character for encoding ASCII
[javadoc] * Vereidigter Buchpr???fer
[javadoc] ^
[javadoc] /build/buildd/bouncycastle-1.39/build/artifacts/jdk1.4/bcprov-jdk14-139/src/org/bouncycastle/asn1/isismtt/x509/ProfessionInfo.java:141: warning: unmappable character for encoding ASCII
[javadoc] * Patentanw???ltin
[javadoc] ^
[javadoc] /build/buildd/bouncycastle-1.39/build/artifacts/jdk1.4/bcprov-jdk14-139/src/org/bouncycastle/asn1/isismtt/x509/ProfessionInfo.java:141: warning: unmappable character for encoding ASCII
[javadoc] * Patentanw???ltin
[javadoc] ^
[javadoc] /build/buildd/bouncycastle-1.39/build/artifacts/jdk1.4/bcprov-jdk14-139/src/org/bouncycastle/asn1/isismtt/x509/ProfessionInfo.java:141: warning: unmappable character for encoding ASCII
[javadoc] * Patentanw???ltin
[javadoc] ^
[javadoc] /build/buildd/bouncycastle-1.39/build/artifacts/jdk1.4/bcprov-jdk14-139/src/org/bouncycastle/asn1/isismtt/x509/MonetaryLimit.java:36: warning: unmappable character for encoding ASCII
[javadoc] * value = amount???10*exponent
[javadoc] ^
[javadoc] /build/buildd/bouncycastle-1.39/build/artifacts/jdk1.4/bcprov-jdk14-139/src/org/bouncycastle/asn1/isismtt/x509/MonetaryLimit.java:36: warning: unmappable character for encoding ASCII
[javadoc] * value = amount???10*exponent
[javadoc] ^
[javadoc] /build/buildd/bouncycastle-1.39/build/artifacts/jdk1.4/bcprov-jdk14-139/src/org/bouncycastle/asn1/isismtt/x509/MonetaryLimit.java:36: warning: unmappable character for encoding ASCII
[javadoc] * value = amount???10*exponent
[javadoc] ^
[javadoc] /build/buildd/bouncycastle-1.39/build/artifacts/jdk1.4/bcprov-jdk14-139/src/org/bouncycastle/asn1/isismtt/x509/MonetaryLimit.java:77: warning: unmappable character for encoding ASCII
[javadoc] * value = amount???10^exponent
[javadoc] ^
[javadoc] /build/buildd/bouncycastle-1.39/build/artifacts/jdk1.4/bcprov-jdk14-139/src/org/bouncycastle/asn1/isismtt/x509/MonetaryLimit.java:77: warning: unmappable character for encoding ASCII
[javadoc] * value = amount???10^exponent
[javadoc] ^
[javadoc] /build/buildd/bouncycastle-1.39/build/artifacts/jdk1.4/bcprov-jdk14-139/src/org/bouncycastle/asn1/isismtt/x509/MonetaryLimit.java:77: warning: unmappable character for encoding ASCII
[javadoc] * value = amount???10^exponent
[javadoc] ^
[javadoc] Loading source files for package org.bouncycastle.asn1.kisa...
[javadoc] Loading source files for package org.bouncycastle.asn1.microsoft...
[javadoc] Loading source files for package org.bouncycastle.asn1.misc...
[javadoc] Loading source files for package org.bouncycastle.asn1.mozilla...
[javadoc] Loading source files for package org.bouncycastle.asn1.nist...
[javadoc] Loading source files for package org.bouncycastle.asn1.ntt...
[javadoc] Loading source files for package org.bouncycastle.asn1.ocsp...
[javadoc] Loading source files for package org.bouncycastle.asn1.oiw...
[javadoc] Loading source files for package org.bouncycastle.asn1.pkcs...
[javadoc] Loading source files for package org.bouncycastle.asn1.sec...
[javadoc] Loading source files for package org.bouncycastle.asn1.smime...
[javadoc] Loading source files for package org.bouncycastle.asn1.teletrust...
[javadoc] Loading source files for package org.bouncycastle.asn1.tsp...
[javadoc] Loading source files for package org.bouncycastle.asn1.util...
[javadoc] Loading source files for package org.bouncycastle.asn1.x500...
[javadoc] Loading source files for package org.bouncycastle.asn1.x509...
[javadoc] Loading source files for package org.bouncycastle.asn1.x509.qualified...
[javadoc] Loading source files for package org.bouncycastle.asn1.x509.sigi...
[javadoc] Loading source files for package org.bouncycastle.asn1.x9...
[javadoc] Loading source files for package org.bouncycastle.crypto...
[javadoc] Loading source files for package org.bouncycastle.crypto.agreement...
[javadoc] Loading source files for package org.bouncycastle.crypto.agreement.kdf...
[javadoc] Loading source files for package org.bouncycastle.crypto.digests...
[javadoc] Loading source files for package org.bouncycastle.crypto.encodings...
[javadoc] Loading source files for package org.bouncycastle.crypto.engines...
[javadoc] Loading source files for package org.bouncycastle.crypto.examples...
[javadoc] Loading source files for package org.bouncycastle.crypto.generators...
[javadoc] Loading source files for package org.bouncycastle.crypto.io...
[javadoc] Loading source files for package org.bouncycastle.crypto.macs...
[javadoc] Loading source files for package org.bouncycastle.crypto.modes...
[javadoc] Loading source files for package org.bouncycastle.crypto.paddings...
[javadoc] Loading source files for package org.bouncycastle.crypto.params...
[javadoc] Loading source files for package org.bouncycastle.crypto.prng...
[javadoc] Loading source files for package org.bouncycastle.crypto.signers...
[javadoc] Loading source files for package org.bouncycastle.crypto.tls...
[javadoc] Loading source files for package org.bouncycastle.crypto.util...
[javadoc] Loading source files for package org.bouncycastle.jce...
[javadoc] Loading source files for package org.bouncycastle.jce.examples...
[javadoc] Loading source files for package org.bouncycastle.jce.exception...
[javadoc] Loading source files for package org.bouncycastle.jce.interfaces...
[javadoc] Loading source files for package org.bouncycastle.jce.netscape...
[javadoc] Loading source files for package org.bouncycastle.jce.provider...
[javadoc] /build/buildd/bouncycastle-1.39/build/artifacts/jdk1.4/bcprov-jdk14-139/src/org/bouncycastle/jce/provider/PKIXCertPathValidatorSpi.java:30: warning: unmappable character for encoding ASCII
[javadoc] * CertPathValidatorSpi implementation for X.509 Certificate validation ??? la RFC
[javadoc] ^
[javadoc] /build/buildd/bouncycastle-1.39/build/artifacts/jdk1.4/bcprov-jdk14-139/src/org/bouncycastle/jce/provider/PKIXCertPathValidatorSpi.java:30: warning: unmappable character for encoding ASCII
[javadoc] * CertPathValidatorSpi implementation for X.509 Certificate validation ??? la RFC
[javadoc] ^
[javadoc] /build/buildd/bouncycastle-1.39/build/artifacts/jdk1.4/bcprov-jdk14-139/src/org/bouncycastle/jce/provider/PKIXCertPathValidatorSpi.java:30: warning: unmappable character for encoding ASCII
[javadoc] * CertPathValidatorSpi implementation for X.509 Certificate validation ??? la RFC
[javadoc] ^
[javadoc] Loading source files for package org.bouncycastle.jce.provider.symmetric...
[javadoc] Loading source files for package org.bouncycastle.jce.provider.test...
[javadoc] Loading source files for package org.bouncycastle.jce.provider.test.nist...
[javadoc] Loading source files for package org.bouncycastle.jce.provider.test.rsa3...
[javadoc] Loading source files for package org.bouncycastle.jce.spec...
[javadoc] Loading source files for package org.bouncycastle.mozilla...
[javadoc] Loading source files for package org.bouncycastle.ocsp...
[javadoc] Loading source files for package org.bouncycastle.ocsp.test...
[javadoc] Loading source files for package org.bouncycastle.openssl...
[javadoc] Loading source files for package org.bouncycastle.openssl.test...
[javadoc] Loading source files for package org.bouncycastle.util...
[javadoc] Loading source files for package org.bouncycastle.util.encoders...
[javadoc] Loading source files for package org.bouncycastle.util.io...
[javadoc] Loading source files for package org.bouncycastle.util.test...
[javadoc] Loading source files for package org.bouncycastle.x509...
[javadoc] Loading source files for package org.bouncycastle.x509.examples...
[javadoc] Loading source files for package org.bouncycastle.x509.extension...
[javadoc] Loading source files for package org.bouncycastle.x509.util...
[javadoc] Constructing Javadoc information...
[javadoc] /build/buildd/bouncycastle-1.39/build/artifacts/jdk1.4/bcprov-jdk14-139/src/org/bouncycastle/jce/provider/test/AllTests.java:9: package junit.framework does not exist
[javadoc] import junit.framework.*;
[javadoc] ^
[javadoc] /build/buildd/bouncycastle-1.39/build/artifacts/jdk1.4/bcprov-jdk14-139/src/org/bouncycastle/jce/provider/test/AllTests.java:12: cannot find symbol
[javadoc] symbol: class TestCase
[javadoc] extends TestCase
[javadoc] ^
[javadoc] /build/buildd/bouncycastle-1.39/build/artifacts/jdk1.4/bcprov-jdk14-139/src/org/bouncycastle/jce/provider/test/AllTests.java:34: cannot find symbol
[javadoc] symbol : class Test
[javadoc] location: class org.bouncycastle.jce.provider.test.AllTests
[javadoc] public static Test suite()
[javadoc] ^
[javadoc] /build/buildd/bouncycastle-1.39/build/artifacts/jdk1.4/bcprov-jdk14-139/src/org/bouncycastle/jce/provider/test/nist/NistCertPathTest.java:3: package junit.framework does not exist
[javadoc] import junit.framework.Test;
[javadoc] ^
[javadoc] /build/buildd/bouncycastle-1.39/build/artifacts/jdk1.4/bcprov-jdk14-139/src/org/bouncycastle/jce/provider/test/nist/NistCertPathTest.java:4: package junit.framework does not exist
[javadoc] import junit.framework.TestCase;
[javadoc] ^
[javadoc] /build/buildd/bouncycastle-1.39/build/artifacts/jdk1.4/bcprov-jdk14-139/src/org/bouncycastle/jce/provider/test/nist/NistCertPathTest.java:5: package junit.framework does not exist
[javadoc] import junit.framework.TestSuite;
[javadoc] ^
[javadoc] /build/buildd/bouncycastle-1.39/build/artifacts/jdk1.4/bcprov-jdk14-139/src/org/bouncycastle/jce/provider/test/nist/NistCertPathTest.java:43: cannot find symbol
[javadoc] symbol: class TestCase
[javadoc] extends TestCase
[javadoc] ^
[javadoc] /build/buildd/bouncycastle-1.39/build/artifacts/jdk1.4/bcprov-jdk14-139/src/org/bouncycastle/jce/provider/test/nist/NistCertPathTest.java:837: cannot find symbol
[javadoc] symbol : class Test
[javadoc] location: class org.bouncycastle.jce.provider.test.nist.NistCertPathTest
[javadoc] public static Test suite()
[javadoc] ^
[javadoc] /build/buildd/bouncycastle-1.39/build/artifacts/jdk1.4/bcprov-jdk14-139/src/org/bouncycastle/jce/provider/test/rsa3/RSA3CertTest.java:3: package junit.framework does not exist
[javadoc] import junit.framework.Test;
[javadoc] ^
[javadoc] /build/buildd/bouncycastle-1.39/build/artifacts/jdk1.4/bcprov-jdk14-139/src/org/bouncycastle/jce/provider/test/rsa3/RSA3CertTest.java:4: package junit.framework does not exist
[javadoc] import junit.framework.TestCase;
[javadoc] ^
[javadoc] /build/buildd/bouncycastle-1.39/build/artifacts/jdk1.4/bcprov-jdk14-139/src/org/bouncycastle/jce/provider/test/rsa3/RSA3CertTest.java:5: package junit.framework does not exist
[javadoc] import junit.framework.TestSuite;
[javadoc] ^
[javadoc] /build/buildd/bouncycastle-1.39/build/artifacts/jdk1.4/bcprov-jdk14-139/src/org/bouncycastle/jce/provider/test/rsa3/RSA3CertTest.java:18: cannot find symbol
[javadoc] symbol: class TestCase
[javadoc] extends TestCase
[javadoc] ^
[javadoc] /build/buildd/bouncycastle-1.39/build/artifacts/jdk1.4/bcprov-jdk14-139/src/org/bouncycastle/jce/provider/test/rsa3/RSA3CertTest.java:125: cannot find symbol
[javadoc] symbol : class Test
[javadoc] location: class org.bouncycastle.jce.provider.test.rsa3.RSA3CertTest
[javadoc] public static Test suite()
[javadoc] ^
[javadoc] /build/buildd/bouncycastle-1.39/build/artifacts/jdk1.4/bcprov-jdk14-139/src/org/bouncycastle/ocsp/test/AllTests.java:5: package junit.framework does not exist
[javadoc] import junit.framework.Test;
[javadoc] ^
[javadoc] /build/buildd/bouncycastle-1.39/build/artifacts/jdk1.4/bcprov-jdk14-139/src/org/bouncycastle/ocsp/test/AllTests.java:6: package junit.framework does not exist
[javadoc] import junit.framework.TestCase;
[javadoc] ^
[javadoc] /build/buildd/bouncycastle-1.39/build/artifacts/jdk1.4/bcprov-jdk14-139/src/org/bouncycastle/ocsp/test/AllTests.java:7: package junit.framework does not exist
[javadoc] import junit.framework.TestSuite;
[javadoc] ^
[javadoc] /build/buildd/bouncycastle-1.39/build/artifacts/jdk1.4/bcprov-jdk14-139/src/org/bouncycastle/ocsp/test/AllTests.java:13: cannot find symbol
[javadoc] symbol: class TestCase
[javadoc] extends TestCase
[javadoc] ^
[javadoc] /build/buildd/bouncycastle-1.39/build/artifacts/jdk1.4/bcprov-jdk14-139/src/org/bouncycastle/ocsp/test/AllTests.java:37: cannot find symbol
[javadoc] symbol : class Test
[javadoc] location: class org.bouncycastle.ocsp.test.AllTests
[javadoc] public static Test suite()
[javadoc] ^
[javadoc] /build/buildd/bouncycastle-1.39/build/artifacts/jdk1.4/bcprov-jdk14-139/src/org/bouncycastle/openssl/test/AllTests.java:8: package junit.framework does not exist
[javadoc] import junit.framework.*;
[javadoc] ^
[javadoc] /build/buildd/bouncycastle-1.39/build/artifacts/jdk1.4/bcprov-jdk14-139/src/org/bouncycastle/openssl/test/AllTests.java:11: cannot find symbol
[javadoc] symbol: class TestCase
[javadoc] extends TestCase
[javadoc] ^
[javadoc] /build/buildd/bouncycastle-1.39/build/artifacts/jdk1.4/bcprov-jdk14-139/src/org/bouncycastle/openssl/test/AllTests.java:39: cannot find symbol
[javadoc] symbol : class Test
[javadoc] location: class org.bouncycastle.openssl.test.AllTests
[javadoc] public static Test suite()
[javadoc] ^
[javadoc] /build/buildd/bouncycastle-1.39/build/artifacts/jdk1.4/bcprov-jdk14-139/src/org/bouncycastle/util/IPTest.java:3: package junit.framework does not exist
[javadoc] import junit.framework.TestCase;
[javadoc] ^
[javadoc] /build/buildd/bouncycastle-1.39/build/artifacts/jdk1.4/bcprov-jdk14-139/src/org/bouncycastle/util/IPTest.java:6: cannot find symbol
[javadoc] symbol: class TestCase
[javadoc] extends TestCase
[javadoc] ^
[javadoc] /build/buildd/bouncycastle-1.39/build/artifacts/jdk1.4/bcprov-jdk14-139/src/org/bouncycastle/util/AllTests.java:3: package junit.framework does not exist
[javadoc] import junit.framework.Test;
[javadoc] ^
[javadoc] /build/buildd/bouncycastle-1.39/build/artifacts/jdk1.4/bcprov-jdk14-139/src/org/bouncycastle/util/AllTests.java:4: package junit.framework does not exist
[javadoc] import junit.framework.TestSuite;
[javadoc] ^
[javadoc] /build/buildd/bouncycastle-1.39/build/artifacts/jdk1.4/bcprov-jdk14-139/src/org/bouncycastle/util/AllTests.java:13: cannot find symbol
[javadoc] symbol : class Test
[javadoc] location: class org.bouncycastle.util.AllTests
[javadoc] public static Test suite()
[javadoc] ^
[javadoc] Standard Doclet version 1.6.0_0
[javadoc] Building tree for all the packages and classes...
[javadoc] Building index for all the packages and classes...
[javadoc] Building index for all classes...
[javadoc] Generating /build/buildd/bouncycastle-1.39/build/artifacts/jdk1.4/javadoc/bcprov/stylesheet.css...
[javadoc] 91 warnings
[copy] Copying 1454 files to /build/buildd/bouncycastle-1.39/build/artifacts/jdk1.4/bcprov-jdk14-139/docs
BUILD SUCCESSFUL
Total time: 14 minutes 3 seconds
+ ant -f jdk14.xml build
Buildfile: jdk14.xml
init:
[copy] Copying 23 files to /build/buildd/bouncycastle-1.39/build/jdk1.4
build:
build-lw:
[mkdir] Created dir: /build/buildd/bouncycastle-1.39/build/artifacts/jdk1.4/lcrypto-jdk14-139
[mkdir] Created dir: /build/buildd/bouncycastle-1.39/build/artifacts/jdk1.4/lcrypto-jdk14-139/src
[mkdir] Created dir: /build/buildd/bouncycastle-1.39/build/artifacts/jdk1.4/lcrypto-jdk14-139/classes
[copy] Copying 5 files to /build/buildd/bouncycastle-1.39/build/artifacts/jdk1.4/lcrypto-jdk14-139
[copy] Copying 907 files to /build/buildd/bouncycastle-1.39/build/artifacts/jdk1.4/lcrypto-jdk14-139/src
[javac] Compiling 907 source files to /build/buildd/bouncycastle-1.39/build/artifacts/jdk1.4/lcrypto-jdk14-139/classes
[javac] /build/buildd/bouncycastle-1.39/build/artifacts/jdk1.4/lcrypto-jdk14-139/src/org/bouncycastle/asn1/gnu/GNUObjectIdentifiers.java:8: warning: unmappable character for encoding ASCII
[javac] public static final DERObjectIdentifier GnuPG = new DERObjectIdentifier("1.3.6.1.4.1.11591.2"); // GnuPG (??gypten)
[javac] ^
[javac] /build/buildd/bouncycastle-1.39/build/artifacts/jdk1.4/lcrypto-jdk14-139/src/org/bouncycastle/asn1/gnu/GNUObjectIdentifiers.java:8: warning: unmappable character for encoding ASCII
[javac] public static final DERObjectIdentifier GnuPG = new DERObjectIdentifier("1.3.6.1.4.1.11591.2"); // GnuPG (??gypten)
[javac] ^
[javac] /build/buildd/bouncycastle-1.39/build/artifacts/jdk1.4/lcrypto-jdk14-139/src/org/bouncycastle/asn1/isismtt/ISISMTTObjectIdentifiers.java:72: warning: unmappable character for encoding ASCII
[javac] * certificate and that is used as ???security anchor???.
[javac] ^
[javac] /build/buildd/bouncycastle-1.39/build/artifacts/jdk1.4/lcrypto-jdk14-139/src/org/bouncycastle/asn1/isismtt/ISISMTTObjectIdentifiers.java:72: warning: unmappable character for encoding ASCII
[javac] * certificate and that is used as ???security anchor???.
[javac] ^
[javac] /build/buildd/bouncycastle-1.39/build/artifacts/jdk1.4/lcrypto-jdk14-139/src/org/bouncycastle/asn1/isismtt/ISISMTTObjectIdentifiers.java:72: warning: unmappable character for encoding ASCII
[javac] * certificate and that is used as ???security anchor???.
[javac] ^
[javac] /build/buildd/bouncycastle-1.39/build/artifacts/jdk1.4/lcrypto-jdk14-139/src/org/bouncycastle/asn1/isismtt/ISISMTTObjectIdentifiers.java:72: warning: unmappable character for encoding ASCII
[javac] * certificate and that is used as ???security anchor???.
[javac] ^
[javac] /build/buildd/bouncycastle-1.39/build/artifacts/jdk1.4/lcrypto-jdk14-139/src/org/bouncycastle/asn1/isismtt/ISISMTTObjectIdentifiers.java:72: warning: unmappable character for encoding ASCII
[javac] * certificate and that is used as ???security anchor???.
[javac] ^
[javac] /build/buildd/bouncycastle-1.39/build/artifacts/jdk1.4/lcrypto-jdk14-139/src/org/bouncycastle/asn1/isismtt/ISISMTTObjectIdentifiers.java:72: warning: unmappable character for encoding ASCII
[javac] * certificate and that is used as ???security anchor???.
[javac] ^
[javac] /build/buildd/bouncycastle-1.39/build/artifacts/jdk1.4/lcrypto-jdk14-139/src/org/bouncycastle/asn1/isismtt/ocsp/RequestedCertificate.java:22: warning: unmappable character for encoding ASCII
[javac] * may be ???nondownloadable??? certificates, about which the responder must provide
[javac] ^
[javac] /build/buildd/bouncycastle-1.39/build/artifacts/jdk1.4/lcrypto-jdk14-139/src/org/bouncycastle/asn1/isismtt/ocsp/RequestedCertificate.java:22: warning: unmappable character for encoding ASCII
[javac] * may be ???nondownloadable??? certificates, about which the responder must provide
[javac] ^
[javac] /build/buildd/bouncycastle-1.39/build/artifacts/jdk1.4/lcrypto-jdk14-139/src/org/bouncycastle/asn1/isismtt/ocsp/RequestedCertificate.java:22: warning: unmappable character for encoding ASCII
[javac] * may be ???nondownloadable??? certificates, about which the responder must provide
[javac] ^
[javac] /build/buildd/bouncycastle-1.39/build/artifacts/jdk1.4/lcrypto-jdk14-139/src/org/bouncycastle/asn1/isismtt/ocsp/RequestedCertificate.java:22: warning: unmappable character for encoding ASCII
[javac] * may be ???nondownloadable??? certificates, about which the responder must provide
[javac] ^
[javac] /build/buildd/bouncycastle-1.39/build/artifacts/jdk1.4/lcrypto-jdk14-139/src/org/bouncycastle/asn1/isismtt/ocsp/RequestedCertificate.java:22: warning: unmappable character for encoding ASCII
[javac] * may be ???nondownloadable??? certificates, about which the responder must provide
[javac] ^
[javac] /build/buildd/bouncycastle-1.39/build/artifacts/jdk1.4/lcrypto-jdk14-139/src/org/bouncycastle/asn1/isismtt/ocsp/RequestedCertificate.java:22: warning: unmappable character for encoding ASCII
[javac] * may be ???nondownloadable??? certificates, about which the responder must provide
[javac] ^
[javac] /build/buildd/bouncycastle-1.39/build/artifacts/jdk1.4/lcrypto-jdk14-139/src/org/bouncycastle/asn1/isismtt/x509/AdmissionSyntax.java:66: warning: unmappable character for encoding ASCII
[javac] * ???officially??? registered professions (text and possibly OID) as well as
[javac] ^
[javac] /build/buildd/bouncycastle-1.39/build/artifacts/jdk1.4/lcrypto-jdk14-139/src/org/bouncycastle/asn1/isismtt/x509/AdmissionSyntax.java:66: warning: unmappable character for encoding ASCII
[javac] * ???officially??? registered professions (text and possibly OID) as well as
[javac] ^
[javac] /build/buildd/bouncycastle-1.39/build/artifacts/jdk1.4/lcrypto-jdk14-139/src/org/bouncycastle/asn1/isismtt/x509/AdmissionSyntax.java:66: warning: unmappable character for encoding ASCII
[javac] * ???officially??? registered professions (text and possibly OID) as well as
[javac] ^
[javac] /build/buildd/bouncycastle-1.39/build/artifacts/jdk1.4/lcrypto-jdk14-139/src/org/bouncycastle/asn1/isismtt/x509/AdmissionSyntax.java:66: warning: unmappable character for encoding ASCII
[javac] * ???officially??? registered professions (text and possibly OID) as well as
[javac] ^
[javac] /build/buildd/bouncycastle-1.39/build/artifacts/jdk1.4/lcrypto-jdk14-139/src/org/bouncycastle/asn1/isismtt/x509/AdmissionSyntax.java:66: warning: unmappable character for encoding ASCII
[javac] * ???officially??? registered professions (text and possibly OID) as well as
[javac] ^
[javac] /build/buildd/bouncycastle-1.39/build/artifacts/jdk1.4/lcrypto-jdk14-139/src/org/bouncycastle/asn1/isismtt/x509/AdmissionSyntax.java:66: warning: unmappable character for encoding ASCII
[javac] * ???officially??? registered professions (text and possibly OID) as well as
[javac] ^
[javac] /build/buildd/bouncycastle-1.39/build/artifacts/jdk1.4/lcrypto-jdk14-139/src/org/bouncycastle/asn1/isismtt/x509/MonetaryLimit.java:36: warning: unmappable character for encoding ASCII
[javac] * value = amount???10*exponent
[javac] ^
[javac] /build/buildd/bouncycastle-1.39/build/artifacts/jdk1.4/lcrypto-jdk14-139/src/org/bouncycastle/asn1/isismtt/x509/MonetaryLimit.java:36: warning: unmappable character for encoding ASCII
[javac] * value = amount???10*exponent
[javac] ^
[javac] /build/buildd/bouncycastle-1.39/build/artifacts/jdk1.4/lcrypto-jdk14-139/src/org/bouncycastle/asn1/isismtt/x509/MonetaryLimit.java:36: warning: unmappable character for encoding ASCII
[javac] * value = amount???10*exponent
[javac] ^
[javac] /build/buildd/bouncycastle-1.39/build/artifacts/jdk1.4/lcrypto-jdk14-139/src/org/bouncycastle/asn1/isismtt/x509/MonetaryLimit.java:77: warning: unmappable character for encoding ASCII
[javac] * value = amount???10^exponent
[javac] ^
[javac] /build/buildd/bouncycastle-1.39/build/artifacts/jdk1.4/lcrypto-jdk14-139/src/org/bouncycastle/asn1/isismtt/x509/MonetaryLimit.java:77: warning: unmappable character for encoding ASCII
[javac] * value = amount???10^exponent
[javac] ^
[javac] /build/buildd/bouncycastle-1.39/build/artifacts/jdk1.4/lcrypto-jdk14-139/src/org/bouncycastle/asn1/isismtt/x509/MonetaryLimit.java:77: warning: unmappable character for encoding ASCII
[javac] * value = amount???10^exponent
[javac] ^
[javac] /build/buildd/bouncycastle-1.39/build/artifacts/jdk1.4/lcrypto-jdk14-139/src/org/bouncycastle/asn1/isismtt/x509/NamingAuthority.java:40: warning: unmappable character for encoding ASCII
[javac] * ???Recht, Wirtschaft, Steuern??? (???Law, Economy, Taxes???) is registered as the
[javac] ^
[javac] /build/buildd/bouncycastle-1.39/build/artifacts/jdk1.4/lcrypto-jdk14-139/src/org/bouncycastle/asn1/isismtt/x509/NamingAuthority.java:40: warning: unmappable character for encoding ASCII
[javac] * ???Recht, Wirtschaft, Steuern??? (???Law, Economy, Taxes???) is registered as the
[javac] ^
[javac] /build/buildd/bouncycastle-1.39/build/artifacts/jdk1.4/lcrypto-jdk14-139/src/org/bouncycastle/asn1/isismtt/x509/NamingAuthority.java:40: warning: unmappable character for encoding ASCII
[javac] * ???Recht, Wirtschaft, Steuern??? (???Law, Economy, Taxes???) is registered as the
[javac] ^
[javac] /build/buildd/bouncycastle-1.39/build/artifacts/jdk1.4/lcrypto-jdk14-139/src/org/bouncycastle/asn1/isismtt/x509/NamingAuthority.java:40: warning: unmappable character for encoding ASCII
[javac] * ???Recht, Wirtschaft, Steuern??? (???Law, Economy, Taxes???) is registered as the
[javac] ^
[javac] /build/buildd/bouncycastle-1.39/build/artifacts/jdk1.4/lcrypto-jdk14-139/src/org/bouncycastle/asn1/isismtt/x509/NamingAuthority.java:40: warning: unmappable character for encoding ASCII
[javac] * ???Recht, Wirtschaft, Steuern??? (???Law, Economy, Taxes???) is registered as the
[javac] ^
[javac] /build/buildd/bouncycastle-1.39/build/artifacts/jdk1.4/lcrypto-jdk14-139/src/org/bouncycastle/asn1/isismtt/x509/NamingAuthority.java:40: warning: unmappable character for encoding ASCII
[javac] * ???Recht, Wirtschaft, Steuern??? (???Law, Economy, Taxes???) is registered as the
[javac] ^
[javac] /build/buildd/bouncycastle-1.39/build/artifacts/jdk1.4/lcrypto-jdk14-139/src/org/bouncycastle/asn1/isismtt/x509/NamingAuthority.java:40: warning: unmappable character for encoding ASCII
[javac] * ???Recht, Wirtschaft, Steuern??? (???Law, Economy, Taxes???) is registered as the
[javac] ^
[javac] /build/buildd/bouncycastle-1.39/build/artifacts/jdk1.4/lcrypto-jdk14-139/src/org/bouncycastle/asn1/isismtt/x509/NamingAuthority.java:40: warning: unmappable character for encoding ASCII
[javac] * ???Recht, Wirtschaft, Steuern??? (???Law, Economy, Taxes???) is registered as the
[javac] ^
[javac] /build/buildd/bouncycastle-1.39/build/artifacts/jdk1.4/lcrypto-jdk14-139/src/org/bouncycastle/asn1/isismtt/x509/NamingAuthority.java:40: warning: unmappable character for encoding ASCII
[javac] * ???Recht, Wirtschaft, Steuern??? (???Law, Economy, Taxes???) is registered as the
[javac] ^
[javac] /build/buildd/bouncycastle-1.39/build/artifacts/jdk1.4/lcrypto-jdk14-139/src/org/bouncycastle/asn1/isismtt/x509/NamingAuthority.java:40: warning: unmappable character for encoding ASCII
[javac] * ???Recht, Wirtschaft, Steuern??? (???Law, Economy, Taxes???) is registered as the
[javac] ^
[javac] /build/buildd/bouncycastle-1.39/build/artifacts/jdk1.4/lcrypto-jdk14-139/src/org/bouncycastle/asn1/isismtt/x509/NamingAuthority.java:40: warning: unmappable character for encoding ASCII
[javac] * ???Recht, Wirtschaft, Steuern??? (???Law, Economy, Taxes???) is registered as the
[javac] ^
[javac] /build/buildd/bouncycastle-1.39/build/artifacts/jdk1.4/lcrypto-jdk14-139/src/org/bouncycastle/asn1/isismtt/x509/NamingAuthority.java:40: warning: unmappable character for encoding ASCII
[javac] * ???Recht, Wirtschaft, Steuern??? (???Law, Economy, Taxes???) is registered as the
[javac] ^
[javac] /build/buildd/bouncycastle-1.39/build/artifacts/jdk1.4/lcrypto-jdk14-139/src/org/bouncycastle/asn1/isismtt/x509/ProfessionInfo.java:39: warning: unmappable character for encoding ASCII
[javac] * Rechtsanw???ltin
[javac] ^
[javac] /build/buildd/bouncycastle-1.39/build/artifacts/jdk1.4/lcrypto-jdk14-139/src/org/bouncycastle/asn1/isismtt/x509/ProfessionInfo.java:39: warning: unmappable character for encoding ASCII
[javac] * Rechtsanw???ltin
[javac] ^
[javac] /build/buildd/bouncycastle-1.39/build/artifacts/jdk1.4/lcrypto-jdk14-139/src/org/bouncycastle/asn1/isismtt/x509/ProfessionInfo.java:39: warning: unmappable character for encoding ASCII
[javac] * Rechtsanw???ltin
[javac] ^
[javac] /build/buildd/bouncycastle-1.39/build/artifacts/jdk1.4/lcrypto-jdk14-139/src/org/bouncycastle/asn1/isismtt/x509/ProfessionInfo.java:69: warning: unmappable character for encoding ASCII
[javac] * Steuerbevollm???chtigte
[javac] ^
[javac] /build/buildd/bouncycastle-1.39/build/artifacts/jdk1.4/lcrypto-jdk14-139/src/org/bouncycastle/asn1/isismtt/x509/ProfessionInfo.java:69: warning: unmappable character for encoding ASCII
[javac] * Steuerbevollm???chtigte
[javac] ^
[javac] /build/buildd/bouncycastle-1.39/build/artifacts/jdk1.4/lcrypto-jdk14-139/src/org/bouncycastle/asn1/isismtt/x509/ProfessionInfo.java:69: warning: unmappable character for encoding ASCII
[javac] * Steuerbevollm???chtigte
[javac] ^
[javac] /build/buildd/bouncycastle-1.39/build/artifacts/jdk1.4/lcrypto-jdk14-139/src/org/bouncycastle/asn1/isismtt/x509/ProfessionInfo.java:75: warning: unmappable character for encoding ASCII
[javac] * Steuerbevollm???chtigter
[javac] ^
[javac] /build/buildd/bouncycastle-1.39/build/artifacts/jdk1.4/lcrypto-jdk14-139/src/org/bouncycastle/asn1/isismtt/x509/ProfessionInfo.java:75: warning: unmappable character for encoding ASCII
[javac] * Steuerbevollm???chtigter
[javac] ^
[javac] /build/buildd/bouncycastle-1.39/build/artifacts/jdk1.4/lcrypto-jdk14-139/src/org/bouncycastle/asn1/isismtt/x509/ProfessionInfo.java:75: warning: unmappable character for encoding ASCII
[javac] * Steuerbevollm???chtigter
[javac] ^
[javac] /build/buildd/bouncycastle-1.39/build/artifacts/jdk1.4/lcrypto-jdk14-139/src/org/bouncycastle/asn1/isismtt/x509/ProfessionInfo.java:117: warning: unmappable character for encoding ASCII
[javac] * Wirtschaftspr???ferin
[javac] ^
[javac] /build/buildd/bouncycastle-1.39/build/artifacts/jdk1.4/lcrypto-jdk14-139/src/org/bouncycastle/asn1/isismtt/x509/ProfessionInfo.java:117: warning: unmappable character for encoding ASCII
[javac] * Wirtschaftspr???ferin
[javac] ^
[javac] /build/buildd/bouncycastle-1.39/build/artifacts/jdk1.4/lcrypto-jdk14-139/src/org/bouncycastle/asn1/isismtt/x509/ProfessionInfo.java:117: warning: unmappable character for encoding ASCII
[javac] * Wirtschaftspr???ferin
[javac] ^
[javac] /build/buildd/bouncycastle-1.39/build/artifacts/jdk1.4/lcrypto-jdk14-139/src/org/bouncycastle/asn1/isismtt/x509/ProfessionInfo.java:123: warning: unmappable character for encoding ASCII
[javac] * Wirtschaftspr???fer
[javac] ^
[javac] /build/buildd/bouncycastle-1.39/build/artifacts/jdk1.4/lcrypto-jdk14-139/src/org/bouncycastle/asn1/isismtt/x509/ProfessionInfo.java:123: warning: unmappable character for encoding ASCII
[javac] * Wirtschaftspr???fer
[javac] ^
[javac] /build/buildd/bouncycastle-1.39/build/artifacts/jdk1.4/lcrypto-jdk14-139/src/org/bouncycastle/asn1/isismtt/x509/ProfessionInfo.java:123: warning: unmappable character for encoding ASCII
[javac] * Wirtschaftspr???fer
[javac] ^
[javac] /build/buildd/bouncycastle-1.39/build/artifacts/jdk1.4/lcrypto-jdk14-139/src/org/bouncycastle/asn1/isismtt/x509/ProfessionInfo.java:129: warning: unmappable character for encoding ASCII
[javac] * Vereidigte Buchpr???ferin
[javac] ^
[javac] /build/buildd/bouncycastle-1.39/build/artifacts/jdk1.4/lcrypto-jdk14-139/src/org/bouncycastle/asn1/isismtt/x509/ProfessionInfo.java:129: warning: unmappable character for encoding ASCII
[javac] * Vereidigte Buchpr???ferin
[javac] ^
[javac] /build/buildd/bouncycastle-1.39/build/artifacts/jdk1.4/lcrypto-jdk14-139/src/org/bouncycastle/asn1/isismtt/x509/ProfessionInfo.java:129: warning: unmappable character for encoding ASCII
[javac] * Vereidigte Buchpr???ferin
[javac] ^
[javac] /build/buildd/bouncycastle-1.39/build/artifacts/jdk1.4/lcrypto-jdk14-139/src/org/bouncycastle/asn1/isismtt/x509/ProfessionInfo.java:135: warning: unmappable character for encoding ASCII
[javac] * Vereidigter Buchpr???fer
[javac] ^
[javac] /build/buildd/bouncycastle-1.39/build/artifacts/jdk1.4/lcrypto-jdk14-139/src/org/bouncycastle/asn1/isismtt/x509/ProfessionInfo.java:135: warning: unmappable character for encoding ASCII
[javac] * Vereidigter Buchpr???fer
[javac] ^
[javac] /build/buildd/bouncycastle-1.39/build/artifacts/jdk1.4/lcrypto-jdk14-139/src/org/bouncycastle/asn1/isismtt/x509/ProfessionInfo.java:135: warning: unmappable character for encoding ASCII
[javac] * Vereidigter Buchpr???fer
[javac] ^
[javac] /build/buildd/bouncycastle-1.39/build/artifacts/jdk1.4/lcrypto-jdk14-139/src/org/bouncycastle/asn1/isismtt/x509/ProfessionInfo.java:141: warning: unmappable character for encoding ASCII
[javac] * Patentanw???ltin
[javac] ^
[javac] /build/buildd/bouncycastle-1.39/build/artifacts/jdk1.4/lcrypto-jdk14-139/src/org/bouncycastle/asn1/isismtt/x509/ProfessionInfo.java:141: warning: unmappable character for encoding ASCII
[javac] * Patentanw???ltin
[javac] ^
[javac] /build/buildd/bouncycastle-1.39/build/artifacts/jdk1.4/lcrypto-jdk14-139/src/org/bouncycastle/asn1/isismtt/x509/ProfessionInfo.java:141: warning: unmappable character for encoding ASCII
[javac] * Patentanw???ltin
[javac] ^
[javac] /build/buildd/bouncycastle-1.39/build/artifacts/jdk1.4/lcrypto-jdk14-139/src/org/bouncycastle/math/ec/ECAlgorithms.java:33: warning: unmappable character for encoding ASCII
[javac] * 71(7):806???808, Aug./Sept. 1964)
[javac] ^
[javac] /build/buildd/bouncycastle-1.39/build/artifacts/jdk1.4/lcrypto-jdk14-139/src/org/bouncycastle/math/ec/ECAlgorithms.java:33: warning: unmappable character for encoding ASCII
[javac] * 71(7):806???808, Aug./Sept. 1964)
[javac] ^
[javac] /build/buildd/bouncycastle-1.39/build/artifacts/jdk1.4/lcrypto-jdk14-139/src/org/bouncycastle/math/ec/ECAlgorithms.java:33: warning: unmappable character for encoding ASCII
[javac] * 71(7):806???808, Aug./Sept. 1964)
[javac] ^
[javac] Note: Some input files use or override a deprecated API.
[javac] Note: Recompile with -Xlint:deprecation for details.
[javac] Note: Some input files use unchecked or unsafe operations.
[javac] Note: Recompile with -Xlint:unchecked for details.
[javac] 65 warnings
build-mail:
[mkdir] Created dir: /build/buildd/bouncycastle-1.39/build/artifacts/jdk1.4/bcmail-jdk14-139
[copy] Copying 5 files to /build/buildd/bouncycastle-1.39/build/artifacts/jdk1.4/bcmail-jdk14-139
[copy] Copying 121 files to /build/buildd/bouncycastle-1.39/build/artifacts/jdk1.4/bcmail-jdk14-139/src
[mkdir] Created dir: /build/buildd/bouncycastle-1.39/build/bcmail-jdk14-139/classes
[javac] Compiling 119 source files to /build/buildd/bouncycastle-1.39/build/bcmail-jdk14-139/classes
[javac] Note: Some input files use or override a deprecated API.
[javac] Note: Recompile with -Xlint:deprecation for details.
[javac] Note: Some input files use unchecked or unsafe operations.
[javac] Note: Recompile with -Xlint:unchecked for details.
[copy] Copying 2 files to /build/buildd/bouncycastle-1.39/build/bcmail-jdk14-139/classes
[jar] Building jar: /build/buildd/bouncycastle-1.39/build/artifacts/jdk1.4/jars/bcmail-jdk14-139.jar
build-tsp:
[mkdir] Created dir: /build/buildd/bouncycastle-1.39/build/artifacts/jdk1.4/bctsp-jdk14-139
[copy] Copying 5 files to /build/buildd/bouncycastle-1.39/build/artifacts/jdk1.4/bctsp-jdk14-139
[copy] Copying 12 files to /build/buildd/bouncycastle-1.39/build/artifacts/jdk1.4/bctsp-jdk14-139/src
[mkdir] Created dir: /build/buildd/bouncycastle-1.39/build/bctsp-jdk14-139/classes
[javac] Compiling 12 source files to /build/buildd/bouncycastle-1.39/build/bctsp-jdk14-139/classes
[javac] Note: Some input files use unchecked or unsafe operations.
[javac] Note: Recompile with -Xlint:unchecked for details.
[jar] Building jar: /build/buildd/bouncycastle-1.39/build/artifacts/jdk1.4/jars/bctsp-jdk14-139.jar
build-pg:
[mkdir] Created dir: /build/buildd/bouncycastle-1.39/build/artifacts/jdk1.4/bcpg-jdk14-139
[copy] Copying 5 files to /build/buildd/bouncycastle-1.39/build/artifacts/jdk1.4/bcpg-jdk14-139
[copy] Copying 61 files to /build/buildd/bouncycastle-1.39/build/artifacts/jdk1.4/bcpg-jdk14-139/src
[copy] Copying 53 files to /build/buildd/bouncycastle-1.39/build/artifacts/jdk1.4/bcpg-jdk14-139/src
[mkdir] Created dir: /build/buildd/bouncycastle-1.39/build/bcpg-jdk14-139/classes
[javac] Compiling 114 source files to /build/buildd/bouncycastle-1.39/build/bcpg-jdk14-139/classes
[javac] Note: Some input files use unchecked or unsafe operations.
[javac] Note: Recompile with -Xlint:unchecked for details.
[jar] Building jar: /build/buildd/bouncycastle-1.39/build/artifacts/jdk1.4/jars/bcpg-jdk14-139.jar
build-libraries:
build-test:
[mkdir] Created dir: /build/buildd/bouncycastle-1.39/build/artifacts/jdk1.4/bctest-jdk14-139
[copy] Copying 5 files to /build/buildd/bouncycastle-1.39/build/artifacts/jdk1.4/bctest-jdk14-139
[copy] Copying 991 files to /build/buildd/bouncycastle-1.39/build/artifacts/jdk1.4/bctest-jdk14-139/src
[mkdir] Created dir: /build/buildd/bouncycastle-1.39/build/bctest-jdk14-139/classes
[javac] Compiling 300 source files to /build/buildd/bouncycastle-1.39/build/bctest-jdk14-139/classes
[javac] /build/buildd/bouncycastle-1.39/build/artifacts/jdk1.4/bctest-jdk14-139/src/org/bouncycastle/i18n/test/LocalizedMessageTest.java:129: warning: unmappable character for encoding ASCII
[javac] assertEquals("some umlauts ????????????", msg.getEntry("text", Locale.GERMAN, TimeZone.getDefault()));
[javac] ^
[javac] /build/buildd/bouncycastle-1.39/build/artifacts/jdk1.4/bctest-jdk14-139/src/org/bouncycastle/i18n/test/LocalizedMessageTest.java:129: warning: unmappable character for encoding ASCII
[javac] assertEquals("some umlauts ????????????", msg.getEntry("text", Locale.GERMAN, TimeZone.getDefault()));
[javac] ^
[javac] /build/buildd/bouncycastle-1.39/build/artifacts/jdk1.4/bctest-jdk14-139/src/org/bouncycastle/i18n/test/LocalizedMessageTest.java:129: warning: unmappable character for encoding ASCII
[javac] assertEquals("some umlauts ????????????", msg.getEntry("text", Locale.GERMAN, TimeZone.getDefault()));
[javac] ^
[javac] /build/buildd/bouncycastle-1.39/build/artifacts/jdk1.4/bctest-jdk14-139/src/org/bouncycastle/i18n/test/LocalizedMessageTest.java:129: warning: unmappable character for encoding ASCII
[javac] assertEquals("some umlauts ????????????", msg.getEntry("text", Locale.GERMAN, TimeZone.getDefault()));
[javac] ^
[javac] /build/buildd/bouncycastle-1.39/build/artifacts/jdk1.4/bctest-jdk14-139/src/org/bouncycastle/i18n/test/LocalizedMessageTest.java:129: warning: unmappable character for encoding ASCII
[javac] assertEquals("some umlauts ????????????", msg.getEntry("text", Locale.GERMAN, TimeZone.getDefault()));
[javac] ^
[javac] /build/buildd/bouncycastle-1.39/build/artifacts/jdk1.4/bctest-jdk14-139/src/org/bouncycastle/i18n/test/LocalizedMessageTest.java:129: warning: unmappable character for encoding ASCII
[javac] assertEquals("some umlauts ????????????", msg.getEntry("text", Locale.GERMAN, TimeZone.getDefault()));
[javac] ^
[javac] /build/buildd/bouncycastle-1.39/build/artifacts/jdk1.4/bctest-jdk14-139/src/org/bouncycastle/i18n/test/LocalizedMessageTest.java:129: warning: unmappable character for encoding ASCII
[javac] assertEquals("some umlauts ????????????", msg.getEntry("text", Locale.GERMAN, TimeZone.getDefault()));
[javac] ^
[javac] /build/buildd/bouncycastle-1.39/build/artifacts/jdk1.4/bctest-jdk14-139/src/org/bouncycastle/i18n/test/LocalizedMessageTest.java:129: warning: unmappable character for encoding ASCII
[javac] assertEquals("some umlauts ????????????", msg.getEntry("text", Locale.GERMAN, TimeZone.getDefault()));
[javac] ^
[javac] /build/buildd/bouncycastle-1.39/build/artifacts/jdk1.4/bctest-jdk14-139/src/org/bouncycastle/i18n/test/LocalizedMessageTest.java:129: warning: unmappable character for encoding ASCII
[javac] assertEquals("some umlauts ????????????", msg.getEntry("text", Locale.GERMAN, TimeZone.getDefault()));
[javac] ^
[javac] /build/buildd/bouncycastle-1.39/build/artifacts/jdk1.4/bctest-jdk14-139/src/org/bouncycastle/i18n/test/LocalizedMessageTest.java:129: warning: unmappable character for encoding ASCII
[javac] assertEquals("some umlauts ????????????", msg.getEntry("text", Locale.GERMAN, TimeZone.getDefault()));
[javac] ^
[javac] /build/buildd/bouncycastle-1.39/build/artifacts/jdk1.4/bctest-jdk14-139/src/org/bouncycastle/i18n/test/LocalizedMessageTest.java:129: warning: unmappable character for encoding ASCII
[javac] assertEquals("some umlauts ????????????", msg.getEntry("text", Locale.GERMAN, TimeZone.getDefault()));
[javac] ^
[javac] /build/buildd/bouncycastle-1.39/build/artifacts/jdk1.4/bctest-jdk14-139/src/org/bouncycastle/i18n/test/LocalizedMessageTest.java:129: warning: unmappable character for encoding ASCII
[javac] assertEquals("some umlauts ????????????", msg.getEntry("text", Locale.GERMAN, TimeZone.getDefault()));
[javac] ^
[javac] Note: Some input files use or override a deprecated API.
[javac] Note: Recompile with -Xlint:deprecation for details.
[javac] Note: Some input files use unchecked or unsafe operations.
[javac] Note: Recompile with -Xlint:unchecked for details.
[javac] 12 warnings
[copy] Copying 691 files to /build/buildd/bouncycastle-1.39/build/bctest-jdk14-139/classes
[jar] Building jar: /build/buildd/bouncycastle-1.39/build/artifacts/jdk1.4/jars/bctest-jdk14-139.jar
build:
javadoc-lw:
[mkdir] Created dir: /build/buildd/bouncycastle-1.39/build/artifacts/jdk1.4/javadoc/lcrypto
[javadoc] Generating Javadoc
[javadoc] Javadoc execution
[javadoc] Loading source files for package org.bouncycastle.asn1...
[javadoc] Loading source files for package org.bouncycastle.asn1.cmp...
[javadoc] Loading source files for package org.bouncycastle.asn1.cms...
[javadoc] Loading source files for package org.bouncycastle.asn1.crmf...
[javadoc] Loading source files for package org.bouncycastle.asn1.cryptopro...
[javadoc] Loading source files for package org.bouncycastle.asn1.esf...
[javadoc] Loading source files for package org.bouncycastle.asn1.ess...
[javadoc] Loading source files for package org.bouncycastle.asn1.gnu...
[javadoc] /build/buildd/bouncycastle-1.39/build/artifacts/jdk1.4/lcrypto-jdk14-139/src/org/bouncycastle/asn1/gnu/GNUObjectIdentifiers.java:8: warning: unmappable character for encoding ASCII
[javadoc] public static final DERObjectIdentifier GnuPG = new DERObjectIdentifier("1.3.6.1.4.1.11591.2"); // GnuPG (??gypten)
[javadoc] ^
[javadoc] /build/buildd/bouncycastle-1.39/build/artifacts/jdk1.4/lcrypto-jdk14-139/src/org/bouncycastle/asn1/gnu/GNUObjectIdentifiers.java:8: warning: unmappable character for encoding ASCII
[javadoc] public static final DERObjectIdentifier GnuPG = new DERObjectIdentifier("1.3.6.1.4.1.11591.2"); // GnuPG (??gypten)
[javadoc] ^
[javadoc] Loading source files for package org.bouncycastle.asn1.iana...
[javadoc] Loading source files for package org.bouncycastle.asn1.icao...
[javadoc] Loading source files for package org.bouncycastle.asn1.isismtt...
[javadoc] /build/buildd/bouncycastle-1.39/build/artifacts/jdk1.4/lcrypto-jdk14-139/src/org/bouncycastle/asn1/isismtt/ISISMTTObjectIdentifiers.java:72: warning: unmappable character for encoding ASCII
[javadoc] * certificate and that is used as ???security anchor???.
[javadoc] ^
[javadoc] /build/buildd/bouncycastle-1.39/build/artifacts/jdk1.4/lcrypto-jdk14-139/src/org/bouncycastle/asn1/isismtt/ISISMTTObjectIdentifiers.java:72: warning: unmappable character for encoding ASCII
[javadoc] * certificate and that is used as ???security anchor???.
[javadoc] ^
[javadoc] /build/buildd/bouncycastle-1.39/build/artifacts/jdk1.4/lcrypto-jdk14-139/src/org/bouncycastle/asn1/isismtt/ISISMTTObjectIdentifiers.java:72: warning: unmappable character for encoding ASCII
[javadoc] * certificate and that is used as ???security anchor???.
[javadoc] ^
[javadoc] /build/buildd/bouncycastle-1.39/build/artifacts/jdk1.4/lcrypto-jdk14-139/src/org/bouncycastle/asn1/isismtt/ISISMTTObjectIdentifiers.java:72: warning: unmappable character for encoding ASCII
[javadoc] * certificate and that is used as ???security anchor???.
[javadoc] ^
[javadoc] /build/buildd/bouncycastle-1.39/build/artifacts/jdk1.4/lcrypto-jdk14-139/src/org/bouncycastle/asn1/isismtt/ISISMTTObjectIdentifiers.java:72: warning: unmappable character for encoding ASCII
[javadoc] * certificate and that is used as ???security anchor???.
[javadoc] ^
[javadoc] /build/buildd/bouncycastle-1.39/build/artifacts/jdk1.4/lcrypto-jdk14-139/src/org/bouncycastle/asn1/isismtt/ISISMTTObjectIdentifiers.java:72: warning: unmappable character for encoding ASCII
[javadoc] * certificate and that is used as ???security anchor???.
[javadoc] ^
[javadoc] Loading source files for package org.bouncycastle.asn1.isismtt.ocsp...
[javadoc] /build/buildd/bouncycastle-1.39/build/artifacts/jdk1.4/lcrypto-jdk14-139/src/org/bouncycastle/asn1/isismtt/ocsp/RequestedCertificate.java:22: warning: unmappable character for encoding ASCII
[javadoc] * may be ???nondownloadable??? certificates, about which the responder must provide
[javadoc] ^
[javadoc] /build/buildd/bouncycastle-1.39/build/artifacts/jdk1.4/lcrypto-jdk14-139/src/org/bouncycastle/asn1/isismtt/ocsp/RequestedCertificate.java:22: warning: unmappable character for encoding ASCII
[javadoc] * may be ???nondownloadable??? certificates, about which the responder must provide
[javadoc] ^
[javadoc] /build/buildd/bouncycastle-1.39/build/artifacts/jdk1.4/lcrypto-jdk14-139/src/org/bouncycastle/asn1/isismtt/ocsp/RequestedCertificate.java:22: warning: unmappable character for encoding ASCII
[javadoc] * may be ???nondownloadable??? certificates, about which the responder must provide
[javadoc] ^
[javadoc] /build/buildd/bouncycastle-1.39/build/artifacts/jdk1.4/lcrypto-jdk14-139/src/org/bouncycastle/asn1/isismtt/ocsp/RequestedCertificate.java:22: warning: unmappable character for encoding ASCII
[javadoc] * may be ???nondownloadable??? certificates, about which the responder must provide
[javadoc] ^
[javadoc] /build/buildd/bouncycastle-1.39/build/artifacts/jdk1.4/lcrypto-jdk14-139/src/org/bouncycastle/asn1/isismtt/ocsp/RequestedCertificate.java:22: warning: unmappable character for encoding ASCII
[javadoc] * may be ???nondownloadable??? certificates, about which the responder must provide
[javadoc] ^
[javadoc] /build/buildd/bouncycastle-1.39/build/artifacts/jdk1.4/lcrypto-jdk14-139/src/org/bouncycastle/asn1/isismtt/ocsp/RequestedCertificate.java:22: warning: unmappable character for encoding ASCII
[javadoc] * may be ???nondownloadable??? certificates, about which the responder must provide
[javadoc] ^
[javadoc] Loading source files for package org.bouncycastle.asn1.isismtt.x509...
[javadoc] /build/buildd/bouncycastle-1.39/build/artifacts/jdk1.4/lcrypto-jdk14-139/src/org/bouncycastle/asn1/isismtt/x509/AdmissionSyntax.java:66: warning: unmappable character for encoding ASCII
[javadoc] * ???officially??? registered professions (text and possibly OID) as well as
[javadoc] ^
[javadoc] /build/buildd/bouncycastle-1.39/build/artifacts/jdk1.4/lcrypto-jdk14-139/src/org/bouncycastle/asn1/isismtt/x509/AdmissionSyntax.java:66: warning: unmappable character for encoding ASCII
[javadoc] * ???officially??? registered professions (text and possibly OID) as well as
[javadoc] ^
[javadoc] /build/buildd/bouncycastle-1.39/build/artifacts/jdk1.4/lcrypto-jdk14-139/src/org/bouncycastle/asn1/isismtt/x509/AdmissionSyntax.java:66: warning: unmappable character for encoding ASCII
[javadoc] * ???officially??? registered professions (text and possibly OID) as well as
[javadoc] ^
[javadoc] /build/buildd/bouncycastle-1.39/build/artifacts/jdk1.4/lcrypto-jdk14-139/src/org/bouncycastle/asn1/isismtt/x509/AdmissionSyntax.java:66: warning: unmappable character for encoding ASCII
[javadoc] * ???officially??? registered professions (text and possibly OID) as well as
[javadoc] ^
[javadoc] /build/buildd/bouncycastle-1.39/build/artifacts/jdk1.4/lcrypto-jdk14-139/src/org/bouncycastle/asn1/isismtt/x509/AdmissionSyntax.java:66: warning: unmappable character for encoding ASCII
[javadoc] * ???officially??? registered professions (text and possibly OID) as well as
[javadoc] ^
[javadoc] /build/buildd/bouncycastle-1.39/build/artifacts/jdk1.4/lcrypto-jdk14-139/src/org/bouncycastle/asn1/isismtt/x509/AdmissionSyntax.java:66: warning: unmappable character for encoding ASCII
[javadoc] * ???officially??? registered professions (text and possibly OID) as well as
[javadoc] ^
[javadoc] /build/buildd/bouncycastle-1.39/build/artifacts/jdk1.4/lcrypto-jdk14-139/src/org/bouncycastle/asn1/isismtt/x509/NamingAuthority.java:40: warning: unmappable character for encoding ASCII
[javadoc] * ???Recht, Wirtschaft, Steuern??? (???Law, Economy, Taxes???) is registered as the
[javadoc] ^
[javadoc] /build/buildd/bouncycastle-1.39/build/artifacts/jdk1.4/lcrypto-jdk14-139/src/org/bouncycastle/asn1/isismtt/x509/NamingAuthority.java:40: warning: unmappable character for encoding ASCII
[javadoc] * ???Recht, Wirtschaft, Steuern??? (???Law, Economy, Taxes???) is registered as the
[javadoc] ^
[javadoc] /build/buildd/bouncycastle-1.39/build/artifacts/jdk1.4/lcrypto-jdk14-139/src/org/bouncycastle/asn1/isismtt/x509/NamingAuthority.java:40: warning: unmappable character for encoding ASCII
[javadoc] * ???Recht, Wirtschaft, Steuern??? (???Law, Economy, Taxes???) is registered as the
[javadoc] ^
[javadoc] /build/buildd/bouncycastle-1.39/build/artifacts/jdk1.4/lcrypto-jdk14-139/src/org/bouncycastle/asn1/isismtt/x509/NamingAuthority.java:40: warning: unmappable character for encoding ASCII
[javadoc] * ???Recht, Wirtschaft, Steuern??? (???Law, Economy, Taxes???) is registered as the
[javadoc] ^
[javadoc] /build/buildd/bouncycastle-1.39/build/artifacts/jdk1.4/lcrypto-jdk14-139/src/org/bouncycastle/asn1/isismtt/x509/NamingAuthority.java:40: warning: unmappable character for encoding ASCII
[javadoc] * ???Recht, Wirtschaft, Steuern??? (???Law, Economy, Taxes???) is registered as the
[javadoc] ^
[javadoc] /build/buildd/bouncycastle-1.39/build/artifacts/jdk1.4/lcrypto-jdk14-139/src/org/bouncycastle/asn1/isismtt/x509/NamingAuthority.java:40: warning: unmappable character for encoding ASCII
[javadoc] * ???Recht, Wirtschaft, Steuern??? (???Law, Economy, Taxes???) is registered as the
[javadoc] ^
[javadoc] /build/buildd/bouncycastle-1.39/build/artifacts/jdk1.4/lcrypto-jdk14-139/src/org/bouncycastle/asn1/isismtt/x509/NamingAuthority.java:40: warning: unmappable character for encoding ASCII
[javadoc] * ???Recht, Wirtschaft, Steuern??? (???Law, Economy, Taxes???) is registered as the
[javadoc] ^
[javadoc] /build/buildd/bouncycastle-1.39/build/artifacts/jdk1.4/lcrypto-jdk14-139/src/org/bouncycastle/asn1/isismtt/x509/NamingAuthority.java:40: warning: unmappable character for encoding ASCII
[javadoc] * ???Recht, Wirtschaft, Steuern??? (???Law, Economy, Taxes???) is registered as the
[javadoc] ^
[javadoc] /build/buildd/bouncycastle-1.39/build/artifacts/jdk1.4/lcrypto-jdk14-139/src/org/bouncycastle/asn1/isismtt/x509/NamingAuthority.java:40: warning: unmappable character for encoding ASCII
[javadoc] * ???Recht, Wirtschaft, Steuern??? (???Law, Economy, Taxes???) is registered as the
[javadoc] ^
[javadoc] /build/buildd/bouncycastle-1.39/build/artifacts/jdk1.4/lcrypto-jdk14-139/src/org/bouncycastle/asn1/isismtt/x509/NamingAuthority.java:40: warning: unmappable character for encoding ASCII
[javadoc] * ???Recht, Wirtschaft, Steuern??? (???Law, Economy, Taxes???) is registered as the
[javadoc] ^
[javadoc] /build/buildd/bouncycastle-1.39/build/artifacts/jdk1.4/lcrypto-jdk14-139/src/org/bouncycastle/asn1/isismtt/x509/NamingAuthority.java:40: warning: unmappable character for encoding ASCII
[javadoc] * ???Recht, Wirtschaft, Steuern??? (???Law, Economy, Taxes???) is registered as the
[javadoc] ^
[javadoc] /build/buildd/bouncycastle-1.39/build/artifacts/jdk1.4/lcrypto-jdk14-139/src/org/bouncycastle/asn1/isismtt/x509/NamingAuthority.java:40: warning: unmappable character for encoding ASCII
[javadoc] * ???Recht, Wirtschaft, Steuern??? (???Law, Economy, Taxes???) is registered as the
[javadoc] ^
[javadoc] /build/buildd/bouncycastle-1.39/build/artifacts/jdk1.4/lcrypto-jdk14-139/src/org/bouncycastle/asn1/isismtt/x509/ProfessionInfo.java:39: warning: unmappable character for encoding ASCII
[javadoc] * Rechtsanw???ltin
[javadoc] ^
[javadoc] /build/buildd/bouncycastle-1.39/build/artifacts/jdk1.4/lcrypto-jdk14-139/src/org/bouncycastle/asn1/isismtt/x509/ProfessionInfo.java:39: warning: unmappable character for encoding ASCII
[javadoc] * Rechtsanw???ltin
[javadoc] ^
[javadoc] /build/buildd/bouncycastle-1.39/build/artifacts/jdk1.4/lcrypto-jdk14-139/src/org/bouncycastle/asn1/isismtt/x509/ProfessionInfo.java:39: warning: unmappable character for encoding ASCII
[javadoc] * Rechtsanw???ltin
[javadoc] ^
[javadoc] /build/buildd/bouncycastle-1.39/build/artifacts/jdk1.4/lcrypto-jdk14-139/src/org/bouncycastle/asn1/isismtt/x509/ProfessionInfo.java:69: warning: unmappable character for encoding ASCII
[javadoc] * Steuerbevollm???chtigte
[javadoc] ^
[javadoc] /build/buildd/bouncycastle-1.39/build/artifacts/jdk1.4/lcrypto-jdk14-139/src/org/bouncycastle/asn1/isismtt/x509/ProfessionInfo.java:69: warning: unmappable character for encoding ASCII
[javadoc] * Steuerbevollm???chtigte
[javadoc] ^
[javadoc] /build/buildd/bouncycastle-1.39/build/artifacts/jdk1.4/lcrypto-jdk14-139/src/org/bouncycastle/asn1/isismtt/x509/ProfessionInfo.java:69: warning: unmappable character for encoding ASCII
[javadoc] * Steuerbevollm???chtigte
[javadoc] ^
[javadoc] /build/buildd/bouncycastle-1.39/build/artifacts/jdk1.4/lcrypto-jdk14-139/src/org/bouncycastle/asn1/isismtt/x509/ProfessionInfo.java:75: warning: unmappable character for encoding ASCII
[javadoc] * Steuerbevollm???chtigter
[javadoc] ^
[javadoc] /build/buildd/bouncycastle-1.39/build/artifacts/jdk1.4/lcrypto-jdk14-139/src/org/bouncycastle/asn1/isismtt/x509/ProfessionInfo.java:75: warning: unmappable character for encoding ASCII
[javadoc] * Steuerbevollm???chtigter
[javadoc] ^
[javadoc] /build/buildd/bouncycastle-1.39/build/artifacts/jdk1.4/lcrypto-jdk14-139/src/org/bouncycastle/asn1/isismtt/x509/ProfessionInfo.java:75: warning: unmappable character for encoding ASCII
[javadoc] * Steuerbevollm???chtigter
[javadoc] ^
[javadoc] /build/buildd/bouncycastle-1.39/build/artifacts/jdk1.4/lcrypto-jdk14-139/src/org/bouncycastle/asn1/isismtt/x509/ProfessionInfo.java:117: warning: unmappable character for encoding ASCII
[javadoc] * Wirtschaftspr???ferin
[javadoc] ^
[javadoc] /build/buildd/bouncycastle-1.39/build/artifacts/jdk1.4/lcrypto-jdk14-139/src/org/bouncycastle/asn1/isismtt/x509/ProfessionInfo.java:117: warning: unmappable character for encoding ASCII
[javadoc] * Wirtschaftspr???ferin
[javadoc] ^
[javadoc] /build/buildd/bouncycastle-1.39/build/artifacts/jdk1.4/lcrypto-jdk14-139/src/org/bouncycastle/asn1/isismtt/x509/ProfessionInfo.java:117: warning: unmappable character for encoding ASCII
[javadoc] * Wirtschaftspr???ferin
[javadoc] ^
[javadoc] /build/buildd/bouncycastle-1.39/build/artifacts/jdk1.4/lcrypto-jdk14-139/src/org/bouncycastle/asn1/isismtt/x509/ProfessionInfo.java:123: warning: unmappable character for encoding ASCII
[javadoc] * Wirtschaftspr???fer
[javadoc] ^
[javadoc] /build/buildd/bouncycastle-1.39/build/artifacts/jdk1.4/lcrypto-jdk14-139/src/org/bouncycastle/asn1/isismtt/x509/ProfessionInfo.java:123: warning: unmappable character for encoding ASCII
[javadoc] * Wirtschaftspr???fer
[javadoc] ^
[javadoc] /build/buildd/bouncycastle-1.39/build/artifacts/jdk1.4/lcrypto-jdk14-139/src/org/bouncycastle/asn1/isismtt/x509/ProfessionInfo.java:123: warning: unmappable character for encoding ASCII
[javadoc] * Wirtschaftspr???fer
[javadoc] ^
[javadoc] /build/buildd/bouncycastle-1.39/build/artifacts/jdk1.4/lcrypto-jdk14-139/src/org/bouncycastle/asn1/isismtt/x509/ProfessionInfo.java:129: warning: unmappable character for encoding ASCII
[javadoc] * Vereidigte Buchpr???ferin
[javadoc] ^
[javadoc] /build/buildd/bouncycastle-1.39/build/artifacts/jdk1.4/lcrypto-jdk14-139/src/org/bouncycastle/asn1/isismtt/x509/ProfessionInfo.java:129: warning: unmappable character for encoding ASCII
[javadoc] * Vereidigte Buchpr???ferin
[javadoc] ^
[javadoc] /build/buildd/bouncycastle-1.39/build/artifacts/jdk1.4/lcrypto-jdk14-139/src/org/bouncycastle/asn1/isismtt/x509/ProfessionInfo.java:129: warning: unmappable character for encoding ASCII
[javadoc] * Vereidigte Buchpr???ferin
[javadoc] ^
[javadoc] /build/buildd/bouncycastle-1.39/build/artifacts/jdk1.4/lcrypto-jdk14-139/src/org/bouncycastle/asn1/isismtt/x509/ProfessionInfo.java:135: warning: unmappable character for encoding ASCII
[javadoc] * Vereidigter Buchpr???fer
[javadoc] ^
[javadoc] /build/buildd/bouncycastle-1.39/build/artifacts/jdk1.4/lcrypto-jdk14-139/src/org/bouncycastle/asn1/isismtt/x509/ProfessionInfo.java:135: warning: unmappable character for encoding ASCII
[javadoc] * Vereidigter Buchpr???fer
[javadoc] ^
[javadoc] /build/buildd/bouncycastle-1.39/build/artifacts/jdk1.4/lcrypto-jdk14-139/src/org/bouncycastle/asn1/isismtt/x509/ProfessionInfo.java:135: warning: unmappable character for encoding ASCII
[javadoc] * Vereidigter Buchpr???fer
[javadoc] ^
[javadoc] /build/buildd/bouncycastle-1.39/build/artifacts/jdk1.4/lcrypto-jdk14-139/src/org/bouncycastle/asn1/isismtt/x509/ProfessionInfo.java:141: warning: unmappable character for encoding ASCII
[javadoc] * Patentanw???ltin
[javadoc] ^
[javadoc] /build/buildd/bouncycastle-1.39/build/artifacts/jdk1.4/lcrypto-jdk14-139/src/org/bouncycastle/asn1/isismtt/x509/ProfessionInfo.java:141: warning: unmappable character for encoding ASCII
[javadoc] * Patentanw???ltin
[javadoc] ^
[javadoc] /build/buildd/bouncycastle-1.39/build/artifacts/jdk1.4/lcrypto-jdk14-139/src/org/bouncycastle/asn1/isismtt/x509/ProfessionInfo.java:141: warning: unmappable character for encoding ASCII
[javadoc] * Patentanw???ltin
[javadoc] ^
[javadoc] /build/buildd/bouncycastle-1.39/build/artifacts/jdk1.4/lcrypto-jdk14-139/src/org/bouncycastle/asn1/isismtt/x509/MonetaryLimit.java:36: warning: unmappable character for encoding ASCII
[javadoc] * value = amount???10*exponent
[javadoc] ^
[javadoc] /build/buildd/bouncycastle-1.39/build/artifacts/jdk1.4/lcrypto-jdk14-139/src/org/bouncycastle/asn1/isismtt/x509/MonetaryLimit.java:36: warning: unmappable character for encoding ASCII
[javadoc] * value = amount???10*exponent
[javadoc] ^
[javadoc] /build/buildd/bouncycastle-1.39/build/artifacts/jdk1.4/lcrypto-jdk14-139/src/org/bouncycastle/asn1/isismtt/x509/MonetaryLimit.java:36: warning: unmappable character for encoding ASCII
[javadoc] * value = amount???10*exponent
[javadoc] ^
[javadoc] /build/buildd/bouncycastle-1.39/build/artifacts/jdk1.4/lcrypto-jdk14-139/src/org/bouncycastle/asn1/isismtt/x509/MonetaryLimit.java:77: warning: unmappable character for encoding ASCII
[javadoc] * value = amount???10^exponent
[javadoc] ^
[javadoc] /build/buildd/bouncycastle-1.39/build/artifacts/jdk1.4/lcrypto-jdk14-139/src/org/bouncycastle/asn1/isismtt/x509/MonetaryLimit.java:77: warning: unmappable character for encoding ASCII
[javadoc] * value = amount???10^exponent
[javadoc] ^
[javadoc] /build/buildd/bouncycastle-1.39/build/artifacts/jdk1.4/lcrypto-jdk14-139/src/org/bouncycastle/asn1/isismtt/x509/MonetaryLimit.java:77: warning: unmappable character for encoding ASCII
[javadoc] * value = amount???10^exponent
[javadoc] ^
[javadoc] Loading source files for package org.bouncycastle.asn1.kisa...
[javadoc] Loading source files for package org.bouncycastle.asn1.microsoft...
[javadoc] Loading source files for package org.bouncycastle.asn1.misc...
[javadoc] Loading source files for package org.bouncycastle.asn1.mozilla...
[javadoc] Loading source files for package org.bouncycastle.asn1.nist...
[javadoc] Loading source files for package org.bouncycastle.asn1.ntt...
[javadoc] Loading source files for package org.bouncycastle.asn1.ocsp...
[javadoc] Loading source files for package org.bouncycastle.asn1.oiw...
[javadoc] Loading source files for package org.bouncycastle.asn1.pkcs...
[javadoc] Loading source files for package org.bouncycastle.asn1.sec...
[javadoc] Loading source files for package org.bouncycastle.asn1.smime...
[javadoc] Loading source files for package org.bouncycastle.asn1.teletrust...
[javadoc] Loading source files for package org.bouncycastle.asn1.test...
[javadoc] Loading source files for package org.bouncycastle.asn1.tsp...
[javadoc] Loading source files for package org.bouncycastle.asn1.util...
[javadoc] Loading source files for package org.bouncycastle.asn1.x500...
[javadoc] Loading source files for package org.bouncycastle.asn1.x509...
[javadoc] Loading source files for package org.bouncycastle.asn1.x509.qualified...
[javadoc] Loading source files for package org.bouncycastle.asn1.x509.sigi...
[javadoc] Loading source files for package org.bouncycastle.asn1.x9...
[javadoc] Loading source files for package org.bouncycastle.crypto...
[javadoc] Loading source files for package org.bouncycastle.crypto.agreement...
[javadoc] Loading source files for package org.bouncycastle.crypto.agreement.kdf...
[javadoc] Loading source files for package org.bouncycastle.crypto.digests...
[javadoc] Loading source files for package org.bouncycastle.crypto.encodings...
[javadoc] Loading source files for package org.bouncycastle.crypto.engines...
[javadoc] Loading source files for package org.bouncycastle.crypto.examples...
[javadoc] Loading source files for package org.bouncycastle.crypto.generators...
[javadoc] Loading source files for package org.bouncycastle.crypto.io...
[javadoc] Loading source files for package org.bouncycastle.crypto.macs...
[javadoc] Loading source files for package org.bouncycastle.crypto.modes...
[javadoc] Loading source files for package org.bouncycastle.crypto.paddings...
[javadoc] Loading source files for package org.bouncycastle.crypto.params...
[javadoc] Loading source files for package org.bouncycastle.crypto.prng...
[javadoc] Loading source files for package org.bouncycastle.crypto.signers...
[javadoc] Loading source files for package org.bouncycastle.crypto.test...
[javadoc] Loading source files for package org.bouncycastle.crypto.tls...
[javadoc] Loading source files for package org.bouncycastle.crypto.tls.test...
[javadoc] Loading source files for package org.bouncycastle.crypto.util...
[javadoc] Loading source files for package org.bouncycastle.math.ec...
[javadoc] /build/buildd/bouncycastle-1.39/build/artifacts/jdk1.4/lcrypto-jdk14-139/src/org/bouncycastle/math/ec/ECAlgorithms.java:33: warning: unmappable character for encoding ASCII
[javadoc] * 71(7):806???808, Aug./Sept. 1964)
[javadoc] ^
[javadoc] /build/buildd/bouncycastle-1.39/build/artifacts/jdk1.4/lcrypto-jdk14-139/src/org/bouncycastle/math/ec/ECAlgorithms.java:33: warning: unmappable character for encoding ASCII
[javadoc] * 71(7):806???808, Aug./Sept. 1964)
[javadoc] ^
[javadoc] /build/buildd/bouncycastle-1.39/build/artifacts/jdk1.4/lcrypto-jdk14-139/src/org/bouncycastle/math/ec/ECAlgorithms.java:33: warning: unmappable character for encoding ASCII
[javadoc] * 71(7):806???808, Aug./Sept. 1964)
[javadoc] ^
[javadoc] Loading source files for package org.bouncycastle.math.ec.test...
[javadoc] Loading source files for package org.bouncycastle.util...
[javadoc] Loading source files for package org.bouncycastle.util.encoders...
[javadoc] Loading source files for package org.bouncycastle.util.encoders.test...
[javadoc] Loading source files for package org.bouncycastle.util.io...
[javadoc] Loading source files for package org.bouncycastle.util.test...
[javadoc] Constructing Javadoc information...
[javadoc] /build/buildd/bouncycastle-1.39/build/artifacts/jdk1.4/lcrypto-jdk14-139/src/org/bouncycastle/asn1/test/ASN1SequenceParserTest.java:3: package junit.framework does not exist
[javadoc] import junit.framework.Test;
[javadoc] ^
[javadoc] /build/buildd/bouncycastle-1.39/build/artifacts/jdk1.4/lcrypto-jdk14-139/src/org/bouncycastle/asn1/test/ASN1SequenceParserTest.java:4: package junit.framework does not exist
[javadoc] import junit.framework.TestCase;
[javadoc] ^
[javadoc] /build/buildd/bouncycastle-1.39/build/artifacts/jdk1.4/lcrypto-jdk14-139/src/org/bouncycastle/asn1/test/ASN1SequenceParserTest.java:5: package junit.framework does not exist
[javadoc] import junit.framework.TestSuite;
[javadoc] ^
[javadoc] /build/buildd/bouncycastle-1.39/build/artifacts/jdk1.4/lcrypto-jdk14-139/src/org/bouncycastle/asn1/test/ASN1SequenceParserTest.java:21: cannot find symbol
[javadoc] symbol: class TestCase
[javadoc] extends TestCase
[javadoc] ^
[javadoc] /build/buildd/bouncycastle-1.39/build/artifacts/jdk1.4/lcrypto-jdk14-139/src/org/bouncycastle/asn1/test/ASN1SequenceParserTest.java:368: cannot find symbol
[javadoc] symbol : class Test
[javadoc] location: class org.bouncycastle.asn1.test.ASN1SequenceParserTest
[javadoc] public static Test suite()
[javadoc] ^
[javadoc] /build/buildd/bouncycastle-1.39/build/artifacts/jdk1.4/lcrypto-jdk14-139/src/org/bouncycastle/asn1/test/ParseTest.java:6: package junit.framework does not exist
[javadoc] import junit.framework.TestCase;
[javadoc] ^
[javadoc] /build/buildd/bouncycastle-1.39/build/artifacts/jdk1.4/lcrypto-jdk14-139/src/org/bouncycastle/asn1/test/ParseTest.java:20: cannot find symbol
[javadoc] symbol: class TestCase
[javadoc] extends TestCase
[javadoc] ^
[javadoc] /build/buildd/bouncycastle-1.39/build/artifacts/jdk1.4/lcrypto-jdk14-139/src/org/bouncycastle/asn1/test/AllTests.java:5: package junit.framework does not exist
[javadoc] import junit.framework.*;
[javadoc] ^
[javadoc] /build/buildd/bouncycastle-1.39/build/artifacts/jdk1.4/lcrypto-jdk14-139/src/org/bouncycastle/asn1/test/AllTests.java:8: cannot find symbol
[javadoc] symbol: class TestCase
[javadoc] extends TestCase
[javadoc] ^
[javadoc] /build/buildd/bouncycastle-1.39/build/artifacts/jdk1.4/lcrypto-jdk14-139/src/org/bouncycastle/asn1/test/AllTests.java:30: cannot find symbol
[javadoc] symbol : class Test
[javadoc] location: class org.bouncycastle.asn1.test.AllTests
[javadoc] public static Test suite()
[javadoc] ^
[javadoc] /build/buildd/bouncycastle-1.39/build/artifacts/jdk1.4/lcrypto-jdk14-139/src/org/bouncycastle/asn1/test/OctetStringTest.java:7: package junit.framework does not exist
[javadoc] import junit.framework.Test;
[javadoc] ^
[javadoc] /build/buildd/bouncycastle-1.39/build/artifacts/jdk1.4/lcrypto-jdk14-139/src/org/bouncycastle/asn1/test/OctetStringTest.java:8: package junit.framework does not exist
[javadoc] import junit.framework.TestCase;
[javadoc] ^
[javadoc] /build/buildd/bouncycastle-1.39/build/artifacts/jdk1.4/lcrypto-jdk14-139/src/org/bouncycastle/asn1/test/OctetStringTest.java:9: package junit.framework does not exist
[javadoc] import junit.framework.TestSuite;
[javadoc] ^
[javadoc] /build/buildd/bouncycastle-1.39/build/artifacts/jdk1.4/lcrypto-jdk14-139/src/org/bouncycastle/asn1/test/OctetStringTest.java:25: cannot find symbol
[javadoc] symbol: class TestCase
[javadoc] extends TestCase
[javadoc] ^
[javadoc] /build/buildd/bouncycastle-1.39/build/artifacts/jdk1.4/lcrypto-jdk14-139/src/org/bouncycastle/asn1/test/OctetStringTest.java:200: cannot find symbol
[javadoc] symbol : class Test
[javadoc] location: class org.bouncycastle.asn1.test.OctetStringTest
[javadoc] public static Test suite()
[javadoc] ^
[javadoc] /build/buildd/bouncycastle-1.39/build/artifacts/jdk1.4/lcrypto-jdk14-139/src/org/bouncycastle/crypto/test/AllTests.java:3: package junit.framework does not exist
[javadoc] import junit.framework.Test;
[javadoc] ^
[javadoc] /build/buildd/bouncycastle-1.39/build/artifacts/jdk1.4/lcrypto-jdk14-139/src/org/bouncycastle/crypto/test/AllTests.java:4: package junit.framework does not exist
[javadoc] import junit.framework.TestCase;
[javadoc] ^
[javadoc] /build/buildd/bouncycastle-1.39/build/artifacts/jdk1.4/lcrypto-jdk14-139/src/org/bouncycastle/crypto/test/AllTests.java:5: package junit.framework does not exist
[javadoc] import junit.framework.TestSuite;
[javadoc] ^
[javadoc] /build/buildd/bouncycastle-1.39/build/artifacts/jdk1.4/lcrypto-jdk14-139/src/org/bouncycastle/crypto/test/AllTests.java:10: cannot find symbol
[javadoc] symbol: class TestCase
[javadoc] extends TestCase
[javadoc] ^
[javadoc] /build/buildd/bouncycastle-1.39/build/artifacts/jdk1.4/lcrypto-jdk14-139/src/org/bouncycastle/crypto/test/AllTests.java:32: cannot find symbol
[javadoc] symbol : class Test
[javadoc] location: class org.bouncycastle.crypto.test.AllTests
[javadoc] public static Test suite()
[javadoc] ^
[javadoc] /build/buildd/bouncycastle-1.39/build/artifacts/jdk1.4/lcrypto-jdk14-139/src/org/bouncycastle/crypto/tls/test/BasicTlsTest.java:3: package junit.framework does not exist
[javadoc] import junit.framework.TestCase;
[javadoc] ^
[javadoc] /build/buildd/bouncycastle-1.39/build/artifacts/jdk1.4/lcrypto-jdk14-139/src/org/bouncycastle/crypto/tls/test/BasicTlsTest.java:4: package junit.framework does not exist
[javadoc] import junit.framework.TestSuite;
[javadoc] ^
[javadoc] /build/buildd/bouncycastle-1.39/build/artifacts/jdk1.4/lcrypto-jdk14-139/src/org/bouncycastle/crypto/tls/test/BasicTlsTest.java:16: cannot find symbol
[javadoc] symbol: class TestCase
[javadoc] extends TestCase
[javadoc] ^
[javadoc] /build/buildd/bouncycastle-1.39/build/artifacts/jdk1.4/lcrypto-jdk14-139/src/org/bouncycastle/crypto/tls/test/BasicTlsTest.java:85: cannot find symbol
[javadoc] symbol : class TestSuite
[javadoc] location: class org.bouncycastle.crypto.tls.test.BasicTlsTest
[javadoc] public static TestSuite suite()
[javadoc] ^
[javadoc] /build/buildd/bouncycastle-1.39/build/artifacts/jdk1.4/lcrypto-jdk14-139/src/org/bouncycastle/crypto/tls/test/AllTests.java:3: package junit.framework does not exist
[javadoc] import junit.framework.Test;
[javadoc] ^
[javadoc] /build/buildd/bouncycastle-1.39/build/artifacts/jdk1.4/lcrypto-jdk14-139/src/org/bouncycastle/crypto/tls/test/AllTests.java:4: package junit.framework does not exist
[javadoc] import junit.framework.TestSuite;
[javadoc] ^
[javadoc] /build/buildd/bouncycastle-1.39/build/artifacts/jdk1.4/lcrypto-jdk14-139/src/org/bouncycastle/crypto/tls/test/AllTests.java:14: cannot find symbol
[javadoc] symbol : class Test
[javadoc] location: class org.bouncycastle.crypto.tls.test.AllTests
[javadoc] public static Test suite()
[javadoc] ^
[javadoc] /build/buildd/bouncycastle-1.39/build/artifacts/jdk1.4/lcrypto-jdk14-139/src/org/bouncycastle/math/ec/test/ECPointTest.java:7: package junit.framework does not exist
[javadoc] import junit.framework.Test;
[javadoc] ^
[javadoc] /build/buildd/bouncycastle-1.39/build/artifacts/jdk1.4/lcrypto-jdk14-139/src/org/bouncycastle/math/ec/test/ECPointTest.java:8: package junit.framework does not exist
[javadoc] import junit.framework.TestCase;
[javadoc] ^
[javadoc] /build/buildd/bouncycastle-1.39/build/artifacts/jdk1.4/lcrypto-jdk14-139/src/org/bouncycastle/math/ec/test/ECPointTest.java:9: package junit.framework does not exist
[javadoc] import junit.framework.TestSuite;
[javadoc] ^
[javadoc] /build/buildd/bouncycastle-1.39/build/artifacts/jdk1.4/lcrypto-jdk14-139/src/org/bouncycastle/math/ec/test/ECPointTest.java:23: cannot find symbol
[javadoc] symbol: class TestCase
[javadoc] public class ECPointTest extends TestCase
[javadoc] ^
[javadoc] /build/buildd/bouncycastle-1.39/build/artifacts/jdk1.4/lcrypto-jdk14-139/src/org/bouncycastle/math/ec/test/ECPointTest.java:447: cannot find symbol
[javadoc] symbol : class Test
[javadoc] location: class org.bouncycastle.math.ec.test.ECPointTest
[javadoc] public static Test suite()
[javadoc] ^
[javadoc] /build/buildd/bouncycastle-1.39/build/artifacts/jdk1.4/lcrypto-jdk14-139/src/org/bouncycastle/math/ec/test/ECPointPerformanceTest.java:6: package junit.framework does not exist
[javadoc] import junit.framework.TestCase;
[javadoc] ^
[javadoc] /build/buildd/bouncycastle-1.39/build/artifacts/jdk1.4/lcrypto-jdk14-139/src/org/bouncycastle/math/ec/test/ECPointPerformanceTest.java:16: cannot find symbol
[javadoc] symbol: class TestCase
[javadoc] public class ECPointPerformanceTest extends TestCase
[javadoc] ^
[javadoc] /build/buildd/bouncycastle-1.39/build/artifacts/jdk1.4/lcrypto-jdk14-139/src/org/bouncycastle/math/ec/test/AllTests.java:3: package junit.framework does not exist
[javadoc] import junit.framework.Test;
[javadoc] ^
[javadoc] /build/buildd/bouncycastle-1.39/build/artifacts/jdk1.4/lcrypto-jdk14-139/src/org/bouncycastle/math/ec/test/AllTests.java:4: package junit.framework does not exist
[javadoc] import junit.framework.TestSuite;
[javadoc] ^
[javadoc] /build/buildd/bouncycastle-1.39/build/artifacts/jdk1.4/lcrypto-jdk14-139/src/org/bouncycastle/math/ec/test/AllTests.java:14: cannot find symbol
[javadoc] symbol : class Test
[javadoc] location: class org.bouncycastle.math.ec.test.AllTests
[javadoc] public static Test suite()
[javadoc] ^
[javadoc] /build/buildd/bouncycastle-1.39/build/artifacts/jdk1.4/lcrypto-jdk14-139/src/org/bouncycastle/util/IPTest.java:3: package junit.framework does not exist
[javadoc] import junit.framework.TestCase;
[javadoc] ^
[javadoc] /build/buildd/bouncycastle-1.39/build/artifacts/jdk1.4/lcrypto-jdk14-139/src/org/bouncycastle/util/IPTest.java:6: cannot find symbol
[javadoc] symbol: class TestCase
[javadoc] extends TestCase
[javadoc] ^
[javadoc] /build/buildd/bouncycastle-1.39/build/artifacts/jdk1.4/lcrypto-jdk14-139/src/org/bouncycastle/util/AllTests.java:3: package junit.framework does not exist
[javadoc] import junit.framework.Test;
[javadoc] ^
[javadoc] /build/buildd/bouncycastle-1.39/build/artifacts/jdk1.4/lcrypto-jdk14-139/src/org/bouncycastle/util/AllTests.java:4: package junit.framework does not exist
[javadoc] import junit.framework.TestSuite;
[javadoc] ^
[javadoc] /build/buildd/bouncycastle-1.39/build/artifacts/jdk1.4/lcrypto-jdk14-139/src/org/bouncycastle/util/AllTests.java:13: cannot find symbol
[javadoc] symbol : class Test
[javadoc] location: class org.bouncycastle.util.AllTests
[javadoc] public static Test suite()
[javadoc] ^
[javadoc] /build/buildd/bouncycastle-1.39/build/artifacts/jdk1.4/lcrypto-jdk14-139/src/org/bouncycastle/util/encoders/test/AbstractCoderTest.java:8: package junit.framework does not exist
[javadoc] import junit.framework.TestCase;
[javadoc] ^
[javadoc] /build/buildd/bouncycastle-1.39/build/artifacts/jdk1.4/lcrypto-jdk14-139/src/org/bouncycastle/util/encoders/test/AbstractCoderTest.java:12: cannot find symbol
[javadoc] symbol: class TestCase
[javadoc] public abstract class AbstractCoderTest extends TestCase
[javadoc] ^
[javadoc] /build/buildd/bouncycastle-1.39/build/artifacts/jdk1.4/lcrypto-jdk14-139/src/org/bouncycastle/util/encoders/test/AllTests.java:3: package junit.framework does not exist
[javadoc] import junit.framework.*;
[javadoc] ^
[javadoc] /build/buildd/bouncycastle-1.39/build/artifacts/jdk1.4/lcrypto-jdk14-139/src/org/bouncycastle/util/encoders/test/AllTests.java:12: cannot find symbol
[javadoc] symbol : class Test
[javadoc] location: class org.bouncycastle.util.encoders.test.AllTests
[javadoc] public static Test suite()
[javadoc] ^
[javadoc] Standard Doclet version 1.6.0_0
[javadoc] Building tree for all the packages and classes...
[javadoc] Building index for all the packages and classes...
[javadoc] Building index for all classes...
[javadoc] Generating /build/buildd/bouncycastle-1.39/build/artifacts/jdk1.4/javadoc/lcrypto/stylesheet.css...
[javadoc] 111 warnings
[copy] Copying 1022 files to /build/buildd/bouncycastle-1.39/build/artifacts/jdk1.4/lcrypto-jdk14-139/docs
javadoc-mail:
[copy] Copying 31 files to /build/buildd/bouncycastle-1.39/build/artifacts/jdk1.4/bcmail-jdk14-139/src
[mkdir] Created dir: /build/buildd/bouncycastle-1.39/build/artifacts/jdk1.4/javadoc/bcmail
[javadoc] Generating Javadoc
[javadoc] Javadoc execution
[javadoc] Loading source files for package org.bouncycastle.cms...
[javadoc] Loading source files for package org.bouncycastle.cms.test...
[javadoc] Loading source files for package org.bouncycastle.mail.smime...
[javadoc] Loading source files for package org.bouncycastle.mail.smime.examples...
[javadoc] Loading source files for package org.bouncycastle.mail.smime.handlers...
[javadoc] Loading source files for package org.bouncycastle.mail.smime.test...
[javadoc] Loading source files for package org.bouncycastle.mail.smime.util...
[javadoc] Loading source files for package org.bouncycastle.mail.smime.validator...
[javadoc] Loading source files for package org.bouncycastle.sasn1...
[javadoc] Loading source files for package org.bouncycastle.sasn1.cms...
[javadoc] Loading source files for package org.bouncycastle.sasn1.test...
[javadoc] Constructing Javadoc information...
[javadoc] /build/buildd/bouncycastle-1.39/build/artifacts/jdk1.4/bcmail-jdk14-139/src/org/bouncycastle/cms/test/CompressedDataStreamTest.java:8: package junit.framework does not exist
[javadoc] import junit.framework.Test;
[javadoc] ^
[javadoc] /build/buildd/bouncycastle-1.39/build/artifacts/jdk1.4/bcmail-jdk14-139/src/org/bouncycastle/cms/test/CompressedDataStreamTest.java:9: package junit.framework does not exist
[javadoc] import junit.framework.TestCase;
[javadoc] ^
[javadoc] /build/buildd/bouncycastle-1.39/build/artifacts/jdk1.4/bcmail-jdk14-139/src/org/bouncycastle/cms/test/CompressedDataStreamTest.java:10: package junit.framework does not exist
[javadoc] import junit.framework.TestSuite;
[javadoc] ^
[javadoc] /build/buildd/bouncycastle-1.39/build/artifacts/jdk1.4/bcmail-jdk14-139/src/org/bouncycastle/cms/test/CompressedDataStreamTest.java:17: cannot find symbol
[javadoc] symbol: class TestCase
[javadoc] extends TestCase
[javadoc] ^
[javadoc] /build/buildd/bouncycastle-1.39/build/artifacts/jdk1.4/bcmail-jdk14-139/src/org/bouncycastle/cms/test/CompressedDataStreamTest.java:122: cannot find symbol
[javadoc] symbol : class Test
[javadoc] location: class org.bouncycastle.cms.test.CompressedDataStreamTest
[javadoc] public static Test suite()
[javadoc] ^
[javadoc] /build/buildd/bouncycastle-1.39/build/artifacts/jdk1.4/bcmail-jdk14-139/src/org/bouncycastle/cms/test/SignedDataStreamTest.java:3: package junit.framework does not exist
[javadoc] import junit.framework.Test;
[javadoc] ^
[javadoc] /build/buildd/bouncycastle-1.39/build/artifacts/jdk1.4/bcmail-jdk14-139/src/org/bouncycastle/cms/test/SignedDataStreamTest.java:4: package junit.framework does not exist
[javadoc] import junit.framework.TestCase;
[javadoc] ^
[javadoc] /build/buildd/bouncycastle-1.39/build/artifacts/jdk1.4/bcmail-jdk14-139/src/org/bouncycastle/cms/test/SignedDataStreamTest.java:5: package junit.framework does not exist
[javadoc] import junit.framework.TestSuite;
[javadoc] ^
[javadoc] /build/buildd/bouncycastle-1.39/build/artifacts/jdk1.4/bcmail-jdk14-139/src/org/bouncycastle/cms/test/SignedDataStreamTest.java:49: cannot find symbol
[javadoc] symbol: class TestCase
[javadoc] extends TestCase
[javadoc] ^
[javadoc] /build/buildd/bouncycastle-1.39/build/artifacts/jdk1.4/bcmail-jdk14-139/src/org/bouncycastle/cms/test/SignedDataStreamTest.java:1023: cannot find symbol
[javadoc] symbol : class Test
[javadoc] location: class org.bouncycastle.cms.test.SignedDataStreamTest
[javadoc] public static Test suite()
[javadoc] ^
[javadoc] /build/buildd/bouncycastle-1.39/build/artifacts/jdk1.4/bcmail-jdk14-139/src/org/bouncycastle/cms/test/NullProviderTest.java:3: package junit.framework does not exist
[javadoc] import junit.framework.Test;
[javadoc] ^
[javadoc] /build/buildd/bouncycastle-1.39/build/artifacts/jdk1.4/bcmail-jdk14-139/src/org/bouncycastle/cms/test/NullProviderTest.java:4: package junit.framework does not exist
[javadoc] import junit.framework.TestCase;
[javadoc] ^
[javadoc] /build/buildd/bouncycastle-1.39/build/artifacts/jdk1.4/bcmail-jdk14-139/src/org/bouncycastle/cms/test/NullProviderTest.java:5: package junit.framework does not exist
[javadoc] import junit.framework.TestSuite;
[javadoc] ^
[javadoc] /build/buildd/bouncycastle-1.39/build/artifacts/jdk1.4/bcmail-jdk14-139/src/org/bouncycastle/cms/test/NullProviderTest.java:50: cannot find symbol
[javadoc] symbol: class TestCase
[javadoc] extends TestCase
[javadoc] ^
[javadoc] /build/buildd/bouncycastle-1.39/build/artifacts/jdk1.4/bcmail-jdk14-139/src/org/bouncycastle/cms/test/NullProviderTest.java:267: cannot find symbol
[javadoc] symbol : class Test
[javadoc] location: class org.bouncycastle.cms.test.NullProviderTest
[javadoc] public static Test suite()
[javadoc] ^
[javadoc] /build/buildd/bouncycastle-1.39/build/artifacts/jdk1.4/bcmail-jdk14-139/src/org/bouncycastle/cms/test/SignedDataTest.java:3: package junit.framework does not exist
[javadoc] import junit.framework.Test;
[javadoc] ^
[javadoc] /build/buildd/bouncycastle-1.39/build/artifacts/jdk1.4/bcmail-jdk14-139/src/org/bouncycastle/cms/test/SignedDataTest.java:4: package junit.framework does not exist
[javadoc] import junit.framework.TestCase;
[javadoc] ^
[javadoc] /build/buildd/bouncycastle-1.39/build/artifacts/jdk1.4/bcmail-jdk14-139/src/org/bouncycastle/cms/test/SignedDataTest.java:5: package junit.framework does not exist
[javadoc] import junit.framework.TestSuite;
[javadoc] ^
[javadoc] /build/buildd/bouncycastle-1.39/build/artifacts/jdk1.4/bcmail-jdk14-139/src/org/bouncycastle/cms/test/SignedDataTest.java:49: cannot find symbol
[javadoc] symbol: class TestCase
[javadoc] extends TestCase
[javadoc] ^
[javadoc] /build/buildd/bouncycastle-1.39/build/artifacts/jdk1.4/bcmail-jdk14-139/src/org/bouncycastle/cms/test/SignedDataTest.java:244: cannot find symbol
[javadoc] symbol : class Test
[javadoc] location: class org.bouncycastle.cms.test.SignedDataTest
[javadoc] public static Test suite()
[javadoc] ^
[javadoc] /build/buildd/bouncycastle-1.39/build/artifacts/jdk1.4/bcmail-jdk14-139/src/org/bouncycastle/cms/test/CMSTestSetup.java:4: package junit.extensions does not exist
[javadoc] import junit.extensions.TestSetup;
[javadoc] ^
[javadoc] /build/buildd/bouncycastle-1.39/build/artifacts/jdk1.4/bcmail-jdk14-139/src/org/bouncycastle/cms/test/CMSTestSetup.java:5: package junit.framework does not exist
[javadoc] import junit.framework.Test;
[javadoc] ^
[javadoc] /build/buildd/bouncycastle-1.39/build/artifacts/jdk1.4/bcmail-jdk14-139/src/org/bouncycastle/cms/test/CMSTestSetup.java:9: cannot find symbol
[javadoc] symbol: class TestSetup
[javadoc] class CMSTestSetup extends TestSetup
[javadoc] ^
[javadoc] /build/buildd/bouncycastle-1.39/build/artifacts/jdk1.4/bcmail-jdk14-139/src/org/bouncycastle/cms/test/CMSTestSetup.java:11: cannot find symbol
[javadoc] symbol : class Test
[javadoc] location: class org.bouncycastle.cms.test.CMSTestSetup
[javadoc] public CMSTestSetup(Test test)
[javadoc] ^
[javadoc] /build/buildd/bouncycastle-1.39/build/artifacts/jdk1.4/bcmail-jdk14-139/src/org/bouncycastle/cms/test/EnvelopedDataStreamTest.java:3: package junit.framework does not exist
[javadoc] import junit.framework.Test;
[javadoc] ^
[javadoc] /build/buildd/bouncycastle-1.39/build/artifacts/jdk1.4/bcmail-jdk14-139/src/org/bouncycastle/cms/test/EnvelopedDataStreamTest.java:4: package junit.framework does not exist
[javadoc] import junit.framework.TestCase;
[javadoc] ^
[javadoc] /build/buildd/bouncycastle-1.39/build/artifacts/jdk1.4/bcmail-jdk14-139/src/org/bouncycastle/cms/test/EnvelopedDataStreamTest.java:5: package junit.framework does not exist
[javadoc] import junit.framework.TestSuite;
[javadoc] ^
[javadoc] /build/buildd/bouncycastle-1.39/build/artifacts/jdk1.4/bcmail-jdk14-139/src/org/bouncycastle/cms/test/EnvelopedDataStreamTest.java:36: cannot find symbol
[javadoc] symbol: class TestCase
[javadoc] extends TestCase
[javadoc] ^
[javadoc] /build/buildd/bouncycastle-1.39/build/artifacts/jdk1.4/bcmail-jdk14-139/src/org/bouncycastle/cms/test/EnvelopedDataStreamTest.java:626: cannot find symbol
[javadoc] symbol : class Test
[javadoc] location: class org.bouncycastle.cms.test.EnvelopedDataStreamTest
[javadoc] public static Test suite()
[javadoc] ^
[javadoc] /build/buildd/bouncycastle-1.39/build/artifacts/jdk1.4/bcmail-jdk14-139/src/org/bouncycastle/cms/test/CompressedDataTest.java:5: package junit.framework does not exist
[javadoc] import junit.framework.Test;
[javadoc] ^
[javadoc] /build/buildd/bouncycastle-1.39/build/artifacts/jdk1.4/bcmail-jdk14-139/src/org/bouncycastle/cms/test/CompressedDataTest.java:6: package junit.framework does not exist
[javadoc] import junit.framework.TestCase;
[javadoc] ^
[javadoc] /build/buildd/bouncycastle-1.39/build/artifacts/jdk1.4/bcmail-jdk14-139/src/org/bouncycastle/cms/test/CompressedDataTest.java:7: package junit.framework does not exist
[javadoc] import junit.framework.TestSuite;
[javadoc] ^
[javadoc] /build/buildd/bouncycastle-1.39/build/artifacts/jdk1.4/bcmail-jdk14-139/src/org/bouncycastle/cms/test/CompressedDataTest.java:15: cannot find symbol
[javadoc] symbol: class TestCase
[javadoc] extends TestCase
[javadoc] ^
[javadoc] /build/buildd/bouncycastle-1.39/build/artifacts/jdk1.4/bcmail-jdk14-139/src/org/bouncycastle/cms/test/CompressedDataTest.java:41: cannot find symbol
[javadoc] symbol : class Test
[javadoc] location: class org.bouncycastle.cms.test.CompressedDataTest
[javadoc] public static Test suite()
[javadoc] ^
[javadoc] /build/buildd/bouncycastle-1.39/build/artifacts/jdk1.4/bcmail-jdk14-139/src/org/bouncycastle/cms/test/AllTests.java:3: package junit.framework does not exist
[javadoc] import junit.framework.Test;
[javadoc] ^
[javadoc] /build/buildd/bouncycastle-1.39/build/artifacts/jdk1.4/bcmail-jdk14-139/src/org/bouncycastle/cms/test/AllTests.java:4: package junit.framework does not exist
[javadoc] import junit.framework.TestSuite;
[javadoc] ^
[javadoc] /build/buildd/bouncycastle-1.39/build/artifacts/jdk1.4/bcmail-jdk14-139/src/org/bouncycastle/cms/test/AllTests.java:16: cannot find symbol
[javadoc] symbol : class Test
[javadoc] location: class org.bouncycastle.cms.test.AllTests
[javadoc] public static Test suite()
[javadoc] ^
[javadoc] /build/buildd/bouncycastle-1.39/build/artifacts/jdk1.4/bcmail-jdk14-139/src/org/bouncycastle/cms/test/EnvelopedDataTest.java:3: package junit.framework does not exist
[javadoc] import junit.framework.Test;
[javadoc] ^
[javadoc] /build/buildd/bouncycastle-1.39/build/artifacts/jdk1.4/bcmail-jdk14-139/src/org/bouncycastle/cms/test/EnvelopedDataTest.java:4: package junit.framework does not exist
[javadoc] import junit.framework.TestCase;
[javadoc] ^
[javadoc] /build/buildd/bouncycastle-1.39/build/artifacts/jdk1.4/bcmail-jdk14-139/src/org/bouncycastle/cms/test/EnvelopedDataTest.java:5: package junit.framework does not exist
[javadoc] import junit.framework.TestSuite;
[javadoc] ^
[javadoc] /build/buildd/bouncycastle-1.39/build/artifacts/jdk1.4/bcmail-jdk14-139/src/org/bouncycastle/cms/test/EnvelopedDataTest.java:42: cannot find symbol
[javadoc] symbol: class TestCase
[javadoc] extends TestCase
[javadoc] ^
[javadoc] /build/buildd/bouncycastle-1.39/build/artifacts/jdk1.4/bcmail-jdk14-139/src/org/bouncycastle/cms/test/EnvelopedDataTest.java:185: cannot find symbol
[javadoc] symbol : class Test
[javadoc] location: class org.bouncycastle.cms.test.EnvelopedDataTest
[javadoc] public static Test suite()
[javadoc] ^
[javadoc] /build/buildd/bouncycastle-1.39/build/artifacts/jdk1.4/bcmail-jdk14-139/src/org/bouncycastle/cms/test/SunProviderTest.java:3: package junit.framework does not exist
[javadoc] import junit.framework.Test;
[javadoc] ^
[javadoc] /build/buildd/bouncycastle-1.39/build/artifacts/jdk1.4/bcmail-jdk14-139/src/org/bouncycastle/cms/test/SunProviderTest.java:4: package junit.framework does not exist
[javadoc] import junit.framework.TestCase;
[javadoc] ^
[javadoc] /build/buildd/bouncycastle-1.39/build/artifacts/jdk1.4/bcmail-jdk14-139/src/org/bouncycastle/cms/test/SunProviderTest.java:5: package junit.framework does not exist
[javadoc] import junit.framework.TestSuite;
[javadoc] ^
[javadoc] /build/buildd/bouncycastle-1.39/build/artifacts/jdk1.4/bcmail-jdk14-139/src/org/bouncycastle/cms/test/SunProviderTest.java:50: cannot find symbol
[javadoc] symbol: class TestCase
[javadoc] extends TestCase
[javadoc] ^
[javadoc] /build/buildd/bouncycastle-1.39/build/artifacts/jdk1.4/bcmail-jdk14-139/src/org/bouncycastle/cms/test/SunProviderTest.java:267: cannot find symbol
[javadoc] symbol : class Test
[javadoc] location: class org.bouncycastle.cms.test.SunProviderTest
[javadoc] public static Test suite()
[javadoc] ^
[javadoc] /build/buildd/bouncycastle-1.39/build/artifacts/jdk1.4/bcmail-jdk14-139/src/org/bouncycastle/mail/smime/test/SMIMEMiscTest.java:3: package junit.framework does not exist
[javadoc] import junit.framework.Test;
[javadoc] ^
[javadoc] /build/buildd/bouncycastle-1.39/build/artifacts/jdk1.4/bcmail-jdk14-139/src/org/bouncycastle/mail/smime/test/SMIMEMiscTest.java:4: package junit.framework does not exist
[javadoc] import junit.framework.TestCase;
[javadoc] ^
[javadoc] /build/buildd/bouncycastle-1.39/build/artifacts/jdk1.4/bcmail-jdk14-139/src/org/bouncycastle/mail/smime/test/SMIMEMiscTest.java:5: package junit.framework does not exist
[javadoc] import junit.framework.TestSuite;
[javadoc] ^
[javadoc] /build/buildd/bouncycastle-1.39/build/artifacts/jdk1.4/bcmail-jdk14-139/src/org/bouncycastle/mail/smime/test/SMIMEMiscTest.java:49: cannot find symbol
[javadoc] symbol: class TestCase
[javadoc] extends TestCase
[javadoc] ^
[javadoc] /build/buildd/bouncycastle-1.39/build/artifacts/jdk1.4/bcmail-jdk14-139/src/org/bouncycastle/mail/smime/test/SMIMEMiscTest.java:109: cannot find symbol
[javadoc] symbol : class Test
[javadoc] location: class org.bouncycastle.mail.smime.test.SMIMEMiscTest
[javadoc] public static Test suite()
[javadoc] ^
[javadoc] /build/buildd/bouncycastle-1.39/build/artifacts/jdk1.4/bcmail-jdk14-139/src/org/bouncycastle/mail/smime/test/AllTests.java:3: package junit.framework does not exist
[javadoc] import junit.framework.Test;
[javadoc] ^
[javadoc] /build/buildd/bouncycastle-1.39/build/artifacts/jdk1.4/bcmail-jdk14-139/src/org/bouncycastle/mail/smime/test/AllTests.java:4: package junit.framework does not exist
[javadoc] import junit.framework.TestSuite;
[javadoc] ^
[javadoc] /build/buildd/bouncycastle-1.39/build/artifacts/jdk1.4/bcmail-jdk14-139/src/org/bouncycastle/mail/smime/test/AllTests.java:14: cannot find symbol
[javadoc] symbol : class Test
[javadoc] location: class org.bouncycastle.mail.smime.test.AllTests
[javadoc] public static Test suite()
[javadoc] ^
[javadoc] /build/buildd/bouncycastle-1.39/build/artifacts/jdk1.4/bcmail-jdk14-139/src/org/bouncycastle/mail/smime/test/SMIMESignedTest.java:3: package junit.framework does not exist
[javadoc] import junit.framework.Test;
[javadoc] ^
[javadoc] /build/buildd/bouncycastle-1.39/build/artifacts/jdk1.4/bcmail-jdk14-139/src/org/bouncycastle/mail/smime/test/SMIMESignedTest.java:4: package junit.framework does not exist
[javadoc] import junit.framework.TestCase;
[javadoc] ^
[javadoc] /build/buildd/bouncycastle-1.39/build/artifacts/jdk1.4/bcmail-jdk14-139/src/org/bouncycastle/mail/smime/test/SMIMESignedTest.java:5: package junit.framework does not exist
[javadoc] import junit.framework.TestSuite;
[javadoc] ^
[javadoc] /build/buildd/bouncycastle-1.39/build/artifacts/jdk1.4/bcmail-jdk14-139/src/org/bouncycastle/mail/smime/test/SMIMESignedTest.java:45: cannot find symbol
[javadoc] symbol: class TestCase
[javadoc] extends TestCase
[javadoc] ^
[javadoc] /build/buildd/bouncycastle-1.39/build/artifacts/jdk1.4/bcmail-jdk14-139/src/org/bouncycastle/mail/smime/test/SMIMESignedTest.java:188: cannot find symbol
[javadoc] symbol : class Test
[javadoc] location: class org.bouncycastle.mail.smime.test.SMIMESignedTest
[javadoc] public static Test suite()
[javadoc] ^
[javadoc] /build/buildd/bouncycastle-1.39/build/artifacts/jdk1.4/bcmail-jdk14-139/src/org/bouncycastle/mail/smime/test/SMIMETestSetup.java:4: package junit.extensions does not exist
[javadoc] import junit.extensions.TestSetup;
[javadoc] ^
[javadoc] /build/buildd/bouncycastle-1.39/build/artifacts/jdk1.4/bcmail-jdk14-139/src/org/bouncycastle/mail/smime/test/SMIMETestSetup.java:5: package junit.framework does not exist
[javadoc] import junit.framework.Test;
[javadoc] ^
[javadoc] /build/buildd/bouncycastle-1.39/build/artifacts/jdk1.4/bcmail-jdk14-139/src/org/bouncycastle/mail/smime/test/SMIMETestSetup.java:11: cannot find symbol
[javadoc] symbol: class TestSetup
[javadoc] class SMIMETestSetup extends TestSetup
[javadoc] ^
[javadoc] /build/buildd/bouncycastle-1.39/build/artifacts/jdk1.4/bcmail-jdk14-139/src/org/bouncycastle/mail/smime/test/SMIMETestSetup.java:15: cannot find symbol
[javadoc] symbol : class Test
[javadoc] location: class org.bouncycastle.mail.smime.test.SMIMETestSetup
[javadoc] public SMIMETestSetup(Test test)
[javadoc] ^
[javadoc] /build/buildd/bouncycastle-1.39/build/artifacts/jdk1.4/bcmail-jdk14-139/src/org/bouncycastle/mail/smime/test/SMIMECompressedTest.java:3: package junit.framework does not exist
[javadoc] import junit.framework.Test;
[javadoc] ^
[javadoc] /build/buildd/bouncycastle-1.39/build/artifacts/jdk1.4/bcmail-jdk14-139/src/org/bouncycastle/mail/smime/test/SMIMECompressedTest.java:4: package junit.framework does not exist
[javadoc] import junit.framework.TestCase;
[javadoc] ^
[javadoc] /build/buildd/bouncycastle-1.39/build/artifacts/jdk1.4/bcmail-jdk14-139/src/org/bouncycastle/mail/smime/test/SMIMECompressedTest.java:5: package junit.framework does not exist
[javadoc] import junit.framework.TestSuite;
[javadoc] ^
[javadoc] /build/buildd/bouncycastle-1.39/build/artifacts/jdk1.4/bcmail-jdk14-139/src/org/bouncycastle/mail/smime/test/SMIMECompressedTest.java:38: cannot find symbol
[javadoc] symbol: class TestCase
[javadoc] extends TestCase
[javadoc] ^
[javadoc] /build/buildd/bouncycastle-1.39/build/artifacts/jdk1.4/bcmail-jdk14-139/src/org/bouncycastle/mail/smime/test/SMIMECompressedTest.java:92: cannot find symbol
[javadoc] symbol : class Test
[javadoc] location: class org.bouncycastle.mail.smime.test.SMIMECompressedTest
[javadoc] public static Test suite()
[javadoc] ^
[javadoc] /build/buildd/bouncycastle-1.39/build/artifacts/jdk1.4/bcmail-jdk14-139/src/org/bouncycastle/mail/smime/test/SMIMEEnvelopedTest.java:14: package junit.framework does not exist
[javadoc] import junit.framework.Test;
[javadoc] ^
[javadoc] /build/buildd/bouncycastle-1.39/build/artifacts/jdk1.4/bcmail-jdk14-139/src/org/bouncycastle/mail/smime/test/SMIMEEnvelopedTest.java:15: package junit.framework does not exist
[javadoc] import junit.framework.TestCase;
[javadoc] ^
[javadoc] /build/buildd/bouncycastle-1.39/build/artifacts/jdk1.4/bcmail-jdk14-139/src/org/bouncycastle/mail/smime/test/SMIMEEnvelopedTest.java:16: package junit.framework does not exist
[javadoc] import junit.framework.TestSuite;
[javadoc] ^
[javadoc] /build/buildd/bouncycastle-1.39/build/artifacts/jdk1.4/bcmail-jdk14-139/src/org/bouncycastle/mail/smime/test/SMIMEEnvelopedTest.java:30: cannot find symbol
[javadoc] symbol: class TestCase
[javadoc] extends TestCase
[javadoc] ^
[javadoc] /build/buildd/bouncycastle-1.39/build/artifacts/jdk1.4/bcmail-jdk14-139/src/org/bouncycastle/mail/smime/test/SMIMEEnvelopedTest.java:77: cannot find symbol
[javadoc] symbol : class Test
[javadoc] location: class org.bouncycastle.mail.smime.test.SMIMEEnvelopedTest
[javadoc] public static Test suite()
[javadoc] ^
[javadoc] /build/buildd/bouncycastle-1.39/build/artifacts/jdk1.4/bcmail-jdk14-139/src/org/bouncycastle/sasn1/test/ParseTest.java:6: package junit.framework does not exist
[javadoc] import junit.framework.TestCase;
[javadoc] ^
[javadoc] /build/buildd/bouncycastle-1.39/build/artifacts/jdk1.4/bcmail-jdk14-139/src/org/bouncycastle/sasn1/test/ParseTest.java:23: cannot find symbol
[javadoc] symbol: class TestCase
[javadoc] extends TestCase
[javadoc] ^
[javadoc] /build/buildd/bouncycastle-1.39/build/artifacts/jdk1.4/bcmail-jdk14-139/src/org/bouncycastle/sasn1/test/Asn1SequenceTest.java:7: package junit.framework does not exist
[javadoc] import junit.framework.Test;
[javadoc] ^
[javadoc] /build/buildd/bouncycastle-1.39/build/artifacts/jdk1.4/bcmail-jdk14-139/src/org/bouncycastle/sasn1/test/Asn1SequenceTest.java:8: package junit.framework does not exist
[javadoc] import junit.framework.TestCase;
[javadoc] ^
[javadoc] /build/buildd/bouncycastle-1.39/build/artifacts/jdk1.4/bcmail-jdk14-139/src/org/bouncycastle/sasn1/test/Asn1SequenceTest.java:9: package junit.framework does not exist
[javadoc] import junit.framework.TestSuite;
[javadoc] ^
[javadoc] /build/buildd/bouncycastle-1.39/build/artifacts/jdk1.4/bcmail-jdk14-139/src/org/bouncycastle/sasn1/test/Asn1SequenceTest.java:23: cannot find symbol
[javadoc] symbol: class TestCase
[javadoc] extends TestCase
[javadoc] ^
[javadoc] /build/buildd/bouncycastle-1.39/build/artifacts/jdk1.4/bcmail-jdk14-139/src/org/bouncycastle/sasn1/test/Asn1SequenceTest.java:328: cannot find symbol
[javadoc] symbol : class Test
[javadoc] location: class org.bouncycastle.sasn1.test.Asn1SequenceTest
[javadoc] public static Test suite()
[javadoc] ^
[javadoc] /build/buildd/bouncycastle-1.39/build/artifacts/jdk1.4/bcmail-jdk14-139/src/org/bouncycastle/sasn1/test/AllTests.java:3: package junit.framework does not exist
[javadoc] import junit.framework.Test;
[javadoc] ^
[javadoc] /build/buildd/bouncycastle-1.39/build/artifacts/jdk1.4/bcmail-jdk14-139/src/org/bouncycastle/sasn1/test/AllTests.java:4: package junit.framework does not exist
[javadoc] import junit.framework.TestSuite;
[javadoc] ^
[javadoc] /build/buildd/bouncycastle-1.39/build/artifacts/jdk1.4/bcmail-jdk14-139/src/org/bouncycastle/sasn1/test/AllTests.java:16: cannot find symbol
[javadoc] symbol : class Test
[javadoc] location: class org.bouncycastle.sasn1.test.AllTests
[javadoc] public static Test suite()
[javadoc] ^
[javadoc] /build/buildd/bouncycastle-1.39/build/artifacts/jdk1.4/bcmail-jdk14-139/src/org/bouncycastle/sasn1/test/OIDTest.java:6: package junit.framework does not exist
[javadoc] import junit.framework.TestCase;
[javadoc] ^
[javadoc] /build/buildd/bouncycastle-1.39/build/artifacts/jdk1.4/bcmail-jdk14-139/src/org/bouncycastle/sasn1/test/OIDTest.java:20: cannot find symbol
[javadoc] symbol: class TestCase
[javadoc] extends TestCase
[javadoc] ^
[javadoc] /build/buildd/bouncycastle-1.39/build/artifacts/jdk1.4/bcmail-jdk14-139/src/org/bouncycastle/sasn1/test/OctetStringTest.java:7: package junit.framework does not exist
[javadoc] import junit.framework.Test;
[javadoc] ^
[javadoc] /build/buildd/bouncycastle-1.39/build/artifacts/jdk1.4/bcmail-jdk14-139/src/org/bouncycastle/sasn1/test/OctetStringTest.java:8: package junit.framework does not exist
[javadoc] import junit.framework.TestCase;
[javadoc] ^
[javadoc] /build/buildd/bouncycastle-1.39/build/artifacts/jdk1.4/bcmail-jdk14-139/src/org/bouncycastle/sasn1/test/OctetStringTest.java:9: package junit.framework does not exist
[javadoc] import junit.framework.TestSuite;
[javadoc] ^
[javadoc] /build/buildd/bouncycastle-1.39/build/artifacts/jdk1.4/bcmail-jdk14-139/src/org/bouncycastle/sasn1/test/OctetStringTest.java:30: cannot find symbol
[javadoc] symbol: class TestCase
[javadoc] extends TestCase
[javadoc] ^
[javadoc] /build/buildd/bouncycastle-1.39/build/artifacts/jdk1.4/bcmail-jdk14-139/src/org/bouncycastle/sasn1/test/OctetStringTest.java:205: cannot find symbol
[javadoc] symbol : class Test
[javadoc] location: class org.bouncycastle.sasn1.test.OctetStringTest
[javadoc] public static Test suite()
[javadoc] ^
[javadoc] Standard Doclet version 1.6.0_0
[javadoc] Building tree for all the packages and classes...
[javadoc] Building index for all the packages and classes...
[javadoc] Building index for all classes...
[javadoc] Generating /build/buildd/bouncycastle-1.39/build/artifacts/jdk1.4/javadoc/bcmail/stylesheet.css...
[javadoc] 91 warnings
[copy] Copying 178 files to /build/buildd/bouncycastle-1.39/build/artifacts/jdk1.4/bcmail-jdk14-139/docs
javadoc-tsp:
[copy] Copying 5 files to /build/buildd/bouncycastle-1.39/build/artifacts/jdk1.4/bctsp-jdk14-139/src
[mkdir] Created dir: /build/buildd/bouncycastle-1.39/build/artifacts/jdk1.4/javadoc/bctsp
[javadoc] Generating Javadoc
[javadoc] Javadoc execution
[javadoc] Loading source files for package org.bouncycastle.tsp...
[javadoc] Loading source files for package org.bouncycastle.tsp.test...
[javadoc] Constructing Javadoc information...
[javadoc] /build/buildd/bouncycastle-1.39/build/artifacts/jdk1.4/bctsp-jdk14-139/src/org/bouncycastle/tsp/test/ParseTest.java:9: package junit.framework does not exist
[javadoc] import junit.framework.TestCase;
[javadoc] ^
[javadoc] /build/buildd/bouncycastle-1.39/build/artifacts/jdk1.4/bctsp-jdk14-139/src/org/bouncycastle/tsp/test/ParseTest.java:23: cannot find symbol
[javadoc] symbol: class TestCase
[javadoc] extends TestCase
[javadoc] ^
[javadoc] /build/buildd/bouncycastle-1.39/build/artifacts/jdk1.4/bctsp-jdk14-139/src/org/bouncycastle/tsp/test/TSPTest.java:15: package junit.framework does not exist
[javadoc] import junit.framework.TestCase;
[javadoc] ^
[javadoc] /build/buildd/bouncycastle-1.39/build/artifacts/jdk1.4/bctsp-jdk14-139/src/org/bouncycastle/tsp/test/TSPTest.java:33: cannot find symbol
[javadoc] symbol: class TestCase
[javadoc] extends TestCase
[javadoc] ^
[javadoc] /build/buildd/bouncycastle-1.39/build/artifacts/jdk1.4/bctsp-jdk14-139/src/org/bouncycastle/tsp/test/AllTests.java:7: package junit.framework does not exist
[javadoc] import junit.framework.Test;
[javadoc] ^
[javadoc] /build/buildd/bouncycastle-1.39/build/artifacts/jdk1.4/bctsp-jdk14-139/src/org/bouncycastle/tsp/test/AllTests.java:8: package junit.framework does not exist
[javadoc] import junit.framework.TestCase;
[javadoc] ^
[javadoc] /build/buildd/bouncycastle-1.39/build/artifacts/jdk1.4/bctsp-jdk14-139/src/org/bouncycastle/tsp/test/AllTests.java:9: package junit.framework does not exist
[javadoc] import junit.framework.TestSuite;
[javadoc] ^
[javadoc] /build/buildd/bouncycastle-1.39/build/artifacts/jdk1.4/bctsp-jdk14-139/src/org/bouncycastle/tsp/test/AllTests.java:12: cannot find symbol
[javadoc] symbol: class TestCase
[javadoc] extends TestCase
[javadoc] ^
[javadoc] /build/buildd/bouncycastle-1.39/build/artifacts/jdk1.4/bctsp-jdk14-139/src/org/bouncycastle/tsp/test/AllTests.java:19: cannot find symbol
[javadoc] symbol : class Test
[javadoc] location: class org.bouncycastle.tsp.test.AllTests
[javadoc] public static Test suite()
[javadoc] ^
[javadoc] Standard Doclet version 1.6.0_0
[javadoc] Building tree for all the packages and classes...
[javadoc] Building index for all the packages and classes...
[javadoc] Building index for all classes...
[javadoc] Generating /build/buildd/bouncycastle-1.39/build/artifacts/jdk1.4/javadoc/bctsp/stylesheet.css...
[javadoc] 9 warnings
[copy] Copying 36 files to /build/buildd/bouncycastle-1.39/build/artifacts/jdk1.4/bctsp-jdk14-139/docs
javadoc-pg:
[copy] Copying 21 files to /build/buildd/bouncycastle-1.39/build/artifacts/jdk1.4/bcpg-jdk14-139/src
[mkdir] Created dir: /build/buildd/bouncycastle-1.39/build/artifacts/jdk1.4/javadoc/bcpg
[javadoc] Generating Javadoc
[javadoc] Javadoc execution
[javadoc] Loading source files for package org.bouncycastle.bcpg...
[javadoc] Loading source files for package org.bouncycastle.bcpg.attr...
[javadoc] Loading source files for package org.bouncycastle.bcpg.sig...
[javadoc] Loading source files for package org.bouncycastle.openpgp...
[javadoc] Loading source files for package org.bouncycastle.openpgp.examples...
[javadoc] Loading source files for package org.bouncycastle.openpgp.examples.test...
[javadoc] Loading source files for package org.bouncycastle.openpgp.test...
[javadoc] Constructing Javadoc information...
[javadoc] /build/buildd/bouncycastle-1.39/build/artifacts/jdk1.4/bcpg-jdk14-139/src/org/bouncycastle/openpgp/examples/test/AllTests.java:3: package junit.framework does not exist
[javadoc] import junit.framework.Test;
[javadoc] ^
[javadoc] /build/buildd/bouncycastle-1.39/build/artifacts/jdk1.4/bcpg-jdk14-139/src/org/bouncycastle/openpgp/examples/test/AllTests.java:4: package junit.framework does not exist
[javadoc] import junit.framework.TestCase;
[javadoc] ^
[javadoc] /build/buildd/bouncycastle-1.39/build/artifacts/jdk1.4/bcpg-jdk14-139/src/org/bouncycastle/openpgp/examples/test/AllTests.java:5: package junit.framework does not exist
[javadoc] import junit.framework.TestSuite;
[javadoc] ^
[javadoc] /build/buildd/bouncycastle-1.39/build/artifacts/jdk1.4/bcpg-jdk14-139/src/org/bouncycastle/openpgp/examples/test/AllTests.java:26: cannot find symbol
[javadoc] symbol: class TestCase
[javadoc] extends TestCase
[javadoc] ^
[javadoc] /build/buildd/bouncycastle-1.39/build/artifacts/jdk1.4/bcpg-jdk14-139/src/org/bouncycastle/openpgp/examples/test/AllTests.java:399: cannot find symbol
[javadoc] symbol : class Test
[javadoc] location: class org.bouncycastle.openpgp.examples.test.AllTests
[javadoc] public static Test suite()
[javadoc] ^
[javadoc] /build/buildd/bouncycastle-1.39/build/artifacts/jdk1.4/bcpg-jdk14-139/src/org/bouncycastle/openpgp/test/DSA2Test.java:3: package junit.framework does not exist
[javadoc] import junit.framework.Test;
[javadoc] ^
[javadoc] /build/buildd/bouncycastle-1.39/build/artifacts/jdk1.4/bcpg-jdk14-139/src/org/bouncycastle/openpgp/test/DSA2Test.java:4: package junit.framework does not exist
[javadoc] import junit.framework.TestCase;
[javadoc] ^
[javadoc] /build/buildd/bouncycastle-1.39/build/artifacts/jdk1.4/bcpg-jdk14-139/src/org/bouncycastle/openpgp/test/DSA2Test.java:5: package junit.framework does not exist
[javadoc] import junit.framework.TestSuite;
[javadoc] ^
[javadoc] /build/buildd/bouncycastle-1.39/build/artifacts/jdk1.4/bcpg-jdk14-139/src/org/bouncycastle/openpgp/test/DSA2Test.java:34: cannot find symbol
[javadoc] symbol: class TestCase
[javadoc] extends TestCase
[javadoc] ^
[javadoc] /build/buildd/bouncycastle-1.39/build/artifacts/jdk1.4/bcpg-jdk14-139/src/org/bouncycastle/openpgp/test/DSA2Test.java:281: cannot find symbol
[javadoc] symbol : class Test
[javadoc] location: class org.bouncycastle.openpgp.test.DSA2Test
[javadoc] public static Test suite()
[javadoc] ^
[javadoc] /build/buildd/bouncycastle-1.39/build/artifacts/jdk1.4/bcpg-jdk14-139/src/org/bouncycastle/openpgp/test/AllTests.java:3: package junit.framework does not exist
[javadoc] import junit.framework.Test;
[javadoc] ^
[javadoc] /build/buildd/bouncycastle-1.39/build/artifacts/jdk1.4/bcpg-jdk14-139/src/org/bouncycastle/openpgp/test/AllTests.java:4: package junit.framework does not exist
[javadoc] import junit.framework.TestCase;
[javadoc] ^
[javadoc] /build/buildd/bouncycastle-1.39/build/artifacts/jdk1.4/bcpg-jdk14-139/src/org/bouncycastle/openpgp/test/AllTests.java:5: package junit.framework does not exist
[javadoc] import junit.framework.TestSuite;
[javadoc] ^
[javadoc] /build/buildd/bouncycastle-1.39/build/artifacts/jdk1.4/bcpg-jdk14-139/src/org/bouncycastle/openpgp/test/AllTests.java:12: cannot find symbol
[javadoc] symbol: class TestCase
[javadoc] extends TestCase
[javadoc] ^
[javadoc] /build/buildd/bouncycastle-1.39/build/artifacts/jdk1.4/bcpg-jdk14-139/src/org/bouncycastle/openpgp/test/AllTests.java:36: cannot find symbol
[javadoc] symbol : class Test
[javadoc] location: class org.bouncycastle.openpgp.test.AllTests
[javadoc] public static Test suite()
[javadoc] ^
[javadoc] Standard Doclet version 1.6.0_0
[javadoc] Building tree for all the packages and classes...
[javadoc] Building index for all the packages and classes...
[javadoc] Building index for all classes...
[javadoc] Generating /build/buildd/bouncycastle-1.39/build/artifacts/jdk1.4/javadoc/bcpg/stylesheet.css...
[javadoc] 15 warnings
[copy] Copying 159 files to /build/buildd/bouncycastle-1.39/build/artifacts/jdk1.4/bcpg-jdk14-139/docs
javadoc-libraries:
BUILD SUCCESSFUL
Total time: 14 minutes 5 seconds
+ ant -f jdk14.xml zip-src
Buildfile: jdk14.xml
zip-src:
zip-src-check:
zip-src-jce:
zip-src-provider:
[zip] Building zip: /build/buildd/bouncycastle-1.39/build/artifacts/jdk1.4/bcprov-jdk14-139/src.zip
[delete] Deleting directory /build/buildd/bouncycastle-1.39/build/artifacts/jdk1.4/bcprov-jdk14-139/src
zip-src:
[zip] Building zip: /build/buildd/bouncycastle-1.39/build/artifacts/jdk1.4/bcmail-jdk14-139/src.zip
[delete] Deleting directory /build/buildd/bouncycastle-1.39/build/artifacts/jdk1.4/bcmail-jdk14-139/src
[zip] Building zip: /build/buildd/bouncycastle-1.39/build/artifacts/jdk1.4/bctsp-jdk14-139/src.zip
[delete] Deleting directory /build/buildd/bouncycastle-1.39/build/artifacts/jdk1.4/bctsp-jdk14-139/src
[zip] Building zip: /build/buildd/bouncycastle-1.39/build/artifacts/jdk1.4/bcpg-jdk14-139/src.zip
[delete] Deleting directory /build/buildd/bouncycastle-1.39/build/artifacts/jdk1.4/bcpg-jdk14-139/src
BUILD SUCCESSFUL
Total time: 36 seconds
sh -x ./build1-4 test
+ JDKPATH=/usr/lib/jvm/default-java
+ JAVA_MAIL_HOME=/usr/share/java
+ JAVA_ACTIVATION_HOME=/usr/share/java
+ JAVA_HOME=/usr/lib/jvm/default-java
+ export JAVA_HOME
+ PATH=/usr/lib/jvm/default-java/bin:/usr/local/sbin:/usr/local/bin:/usr/sbin:/usr/bin:/sbin:/bin:/usr/X11R6/bin:/usr/games
+ export PATH
+ CLASSPATH=/usr/share/java/gnumail.jar:/usr/share/java/activation.jar:
+ export CLASSPATH
+ [ test = test ]
+ ant -f jdk14.xml test
Buildfile: jdk14.xml
init:
[copy] Copying 23 files to /build/buildd/bouncycastle-1.39/build/jdk1.4
build-test:
build-test:
[copy] Copying 9 files to /build/buildd/bouncycastle-1.39/build/artifacts/jdk1.4/bctest-jdk14-139/src
[javac] Compiling 10 source files to /build/buildd/bouncycastle-1.39/build/bctest-jdk14-139/classes
[javac] Note: /build/buildd/bouncycastle-1.39/build/artifacts/jdk1.4/bctest-jdk14-139/src/org/bouncycastle/jce/provider/test/PKCS12StoreTest.java uses or overrides a deprecated API.
[javac] Note: Recompile with -Xlint:deprecation for details.
[javac] Note: /build/buildd/bouncycastle-1.39/build/artifacts/jdk1.4/bctest-jdk14-139/src/org/bouncycastle/jce/provider/test/PKCS12StoreTest.java uses unchecked or unsafe operations.
[javac] Note: Recompile with -Xlint:unchecked for details.
[jar] Building jar: /build/buildd/bouncycastle-1.39/build/artifacts/jdk1.4/jars/bctest-jdk14-139.jar
test:
test:
[junit] Test org.bouncycastle.i18n.test.AllTests FAILED
[junit] Test org.bouncycastle.jce.provider.test.nist.NistCertPathTest FAILED
[junit] Test org.bouncycastle.mail.smime.test.AllTests FAILED
[junitreport] Processing /build/buildd/bouncycastle-1.39/build/artifacts/jdk1.4/reports/xml/TESTS-TestSuites.xml to /tmp/null847726876
[junitreport] Loading stylesheet jar:file:/usr/share/ant/lib/ant-junit.jar!/org/apache/tools/ant/taskdefs/optional/junit/xsl/junit-frames.xsl
[junitreport] Transform time: 19720ms
[junitreport] Deleting: /tmp/null847726876
BUILD SUCCESSFUL
Total time: 140 minutes 22 seconds
mkdir -p debian/build
set -e; \
for j in bcprov bcmail bctsp bcpg; do \
install -m 644 build/artifacts/jdk1.4/jars/$j-jdk14-*.jar \
debian/build/$j.jar; \
done
touch stamp-build-indep
/usr/bin/fakeroot debian/rules binary-arch
test -x debian/rules
dh_testroot
dh_clean -k
dh_installdirs -A
mkdir -p "."
dh_installdirs -plibbcprov-java
dh_installdirs -plibbcprov-java-gcj
dh_installdirs -plibbcmail-java-gcj
dh_installdirs -plibbctsp-java-gcj
dh_installdirs -plibbcpg-java-gcj
dh_installdocs -plibbcprov-java
dh_installexamples -plibbcprov-java
dh_installman -plibbcprov-java
dh_installinfo -plibbcprov-java
dh_installmenu -plibbcprov-java
dh_installcron -plibbcprov-java
dh_installinit -plibbcprov-java
dh_installdebconf -plibbcprov-java
dh_installemacsen -plibbcprov-java
dh_installcatalogs -plibbcprov-java
dh_installpam -plibbcprov-java
dh_installlogrotate -plibbcprov-java
dh_installlogcheck -plibbcprov-java
dh_installchangelogs -plibbcprov-java
dh_installudev -plibbcprov-java
dh_lintian -plibbcprov-java
dh_install -plibbcprov-java
dh_link -plibbcprov-java
dh_installmime -plibbcprov-java
install -m 644 build/artifacts/jdk1.4/jars/bcprov-jdk14-*.jar debian/libbcprov-java/usr/share/java/bcprov.jar
ln -sf ../bcprov.jar debian/libbcprov-java/usr/share/java/gcj-endorsed/bcprov.jar
touch debian/libbcprov-java/etc/java/security/security.d/2000-org.bouncycastle.jce.provider.BouncyCastleProvider
dh_installdocs -plibbcprov-java-gcj
dh_installexamples -plibbcprov-java-gcj
dh_installman -plibbcprov-java-gcj
dh_installinfo -plibbcprov-java-gcj
dh_installmenu -plibbcprov-java-gcj
dh_installcron -plibbcprov-java-gcj
dh_installinit -plibbcprov-java-gcj
dh_installdebconf -plibbcprov-java-gcj
dh_installemacsen -plibbcprov-java-gcj
dh_installcatalogs -plibbcprov-java-gcj
dh_installpam -plibbcprov-java-gcj
dh_installlogrotate -plibbcprov-java-gcj
dh_installlogcheck -plibbcprov-java-gcj
dh_installchangelogs -plibbcprov-java-gcj
dh_installudev -plibbcprov-java-gcj
dh_lintian -plibbcprov-java-gcj
dh_install -plibbcprov-java-gcj
dh_link -plibbcprov-java-gcj
dh_installmime -plibbcprov-java-gcj
rm -rf debian/libbcprov-java-gcj/usr/share/doc/libbcprov-java-gcj
ln -s libbcprov-java \
debian/libbcprov-java-gcj/usr/share/doc/libbcprov-java-gcj
dh_nativejava -plibbcprov-java-gcj
/usr/lib/python2.6/dist-packages/aotcompile.py:19: DeprecationWarning: the md5 module is deprecated; use hashlib instead
import md5
make[1]: Entering directory `/build/buildd/bouncycastle-1.39/debian/libbcprov-java-gcj/usr/lib/gcj'
/usr/bin/gcj -c -fsource-filename=/tmp/fileJeieaj -g -O2 -fPIC -findirect-dispatch -fjni bcprov.jar.1.jar -o bcprov.jar.1.o
/usr/bin/gcj -c -fsource-filename=/tmp/fileJeieaj -g -O2 -fPIC -findirect-dispatch -fjni bcprov.jar.2.jar -o bcprov.jar.2.o
/usr/bin/gcj -c -fsource-filename=/tmp/fileJeieaj -g -O2 -fPIC -findirect-dispatch -fjni bcprov.jar.3.jar -o bcprov.jar.3.o
/usr/bin/gcj -c -fsource-filename=/tmp/fileJeieaj -g -O2 -fPIC -findirect-dispatch -fjni bcprov.jar.4.jar -o bcprov.jar.4.o
/usr/bin/gcj -c -fsource-filename=/tmp/fileJeieaj -g -O2 -fPIC -findirect-dispatch -fjni bcprov.jar.5.jar -o bcprov.jar.5.o
gcj: Internal error: Killed (program jc1)
Please submit a full bug report.
See <file:///usr/share/doc/gcj-4.4/README.Bugs> for instructions.
make[1]: *** [bcprov.jar.5.o] Error 1
make[1]: *** Waiting for unfinished jobs....
make[1]: Leaving directory `/build/buildd/bouncycastle-1.39/debian/libbcprov-java-gcj/usr/lib/gcj'
aot-compile: error: /usr/bin/make exited with code 2
dh_nativejava: aot-compile returned exit code 1
make: *** [binary-post-install/libbcprov-java-gcj] Error 1
dpkg-buildpackage: error: /usr/bin/fakeroot debian/rules binary-arch gave error exit status 2
******************************************************************************
Build finished at 20091022-2156
FAILED [dpkg-buildpackage died]
Purging chroot-karmic-autotest/build/buildd/bouncycastle-1.39
------------------------------------------------------------------------------
/usr/bin/sudo dpkg --root=/srv/home/buildd/build-karmic-autotest/chroot-karmic-autotest --purge groff-base libavahi-common3 libx11-data m4 fontconfig-config gettext file zlib1g-dev libhtml-parser-perl libjaxp1.3-java ttf-dejavu libgnuinet-java libcairo2 openjdk-6-jdk x11-common libgnujaf-java openjdk-6-jre-lib python2.6 libvorbis0a libgcj10-awt libvorbisenc2 gcj-jdk libxi6 gcj-jre automake libjpeg62 libxcursor1 gcj-4.4-base libwrap0 libantlr-java libecj-java-gcj libjasper1 libaccess-bridge-java-jni libxerces2-java libfontconfig1 libnspr4-0d libx11-6 libglib2.0-0 libnewt0.52 libgif4 libpango1.0-common libxdamage1 default-jdk-builddep libgcj10 libhtml-tree-perl libxcb-render-util0 tsconf libhtml-tagset-perl libxml2 libthai-data fastjar libice6 intltool-debian libavahi-client3 libxrender1 ant libcups2 libdatrie1 libgnumail-java openjdk-6-jre ttf-dejavu-extra libavahi-common-data libxtst6 libxft2 libxext6 libsysfs2 libasound2 libsqlite3-0 libxinerama1 libpcre3 tzdata-java ca-ce
rtificates-java libncursesw5 ecj1 gcj-4.4-jre-lib defoma ecj-gcj ttf-dejavu-core gcj-jre-headless libgcj-bc libpulse0 fontconfig liburi-perl autotools-dev rhino gcj-4.4-jdk libcroco3 libpopt0 gcj-4.4-jre-headless libfreetype6 default-jdk libatk1.0-0 libgtk2.0-0 libflac8 libxcb1 libnss3-1d diffstat html2text libsndfile1 libjline-java debhelper libxrandr2 libthai0 python default-jre-headless libmagic1 libtiff4 libexpat1 bsdmainutils fdupes libxau6 libgcj-common libxcomposite1 mime-support whiptail intltool libogg0 libts-0.0-0 libgcj10-dev libwww-perl shared-mime-info libxdmcp6 libxfixes3 default-jre po-debconf quilt libdirectfb-1.2-0 libxml-parser-perl openjdk-6-jre-headless liblcms1 netbase libpython2.6 ant-optional libpng12-0 man-db ecj libpixman-1-0 junit libpango1.0-0 ucf cdbs libgtk2.0-common gettext-base libaccess-bridge-java libsm6 python-central libecj-java gcj-4.4-jre libxcb-render0 java-common autoconf
(Reading database ... 20893 files and directories currently installed.)
Removing default-jdk-builddep ...
Removing libgnumail-java ...
Removing default-jdk ...
Removing default-jre ...
Removing quilt ...
Purging configuration files for quilt ...
Removing ant-optional ...
Removing junit ...
Removing cdbs ...
Removing libgnuinet-java ...
Removing openjdk-6-jdk ...
update-alternatives: using /usr/bin/gjar-4.4 to provide /usr/bin/jar (jar) in auto mode.
update-alternatives: using /usr/bin/gjarsigner-4.4 to provide /usr/bin/jarsigner (jarsigner) in auto mode.
update-alternatives: using /usr/bin/gcj-wrapper-4.4 to provide /usr/bin/javac (javac) in auto mode.
update-alternatives: using /usr/bin/gjdoc-4.4 to provide /usr/bin/javadoc (javadoc) in auto mode.
update-alternatives: using /usr/bin/gjavah-4.4 to provide /usr/bin/javah (javah) in auto mode.
update-alternatives: using /usr/bin/gnative2ascii-4.4 to provide /usr/bin/native2ascii (native2ascii) in auto mode.
update-alternatives: using /usr/bin/grmic-4.4 to provide /usr/bin/rmic (rmic) in auto mode.
update-alternatives: using /usr/bin/gserialver-4.4 to provide /usr/bin/serialver (serialver) in auto mode.
Purging configuration files for openjdk-6-jdk ...
Removing libgnujaf-java ...
Removing gcj-jdk ...
Removing gcj-jre ...
Removing ant ...
Removing openjdk-6-jre ...
Purging configuration files for openjdk-6-jre ...
Removing libasound2 ...
Purging configuration files for libasound2 ...
Removing gcj-jre-headless ...
Removing libpulse0 ...
Purging configuration files for libpulse0 ...
Removing diffstat ...
Removing libsndfile1 ...
Purging configuration files for libsndfile1 ...
Removing debhelper ...
Removing default-jre-headless ...
Removing fdupes ...
Removing intltool ...
Removing po-debconf ...
Removing libxml-parser-perl ...
Removing libpython2.6 ...
Purging configuration files for libpython2.6 ...
Removing man-db ...
Purging configuration files for man-db ...
Removing groff-base ...
Purging configuration files for groff-base ...
Removing libvorbisenc2 ...
Purging configuration files for libvorbisenc2 ...
Removing automake ...
Removing libwrap0 ...
Purging configuration files for libwrap0 ...
Removing libaccess-bridge-java-jni ...
Purging configuration files for libaccess-bridge-java-jni ...
Removing libxerces2-java ...
Removing libgif4 ...
Purging configuration files for libgif4 ...
Removing intltool-debian ...
Removing autotools-dev ...
Removing libflac8 ...
Purging configuration files for libflac8 ...
Removing html2text ...
Purging configuration files for html2text ...
Removing bsdmainutils ...
Purging configuration files for bsdmainutils ...
Removing libwww-perl ...
Removing netbase ...
Purging configuration files for netbase ...
dpkg - warning: while removing netbase, directory `/etc/network' not empty so not removed.
Removing libaccess-bridge-java ...
Removing autoconf ...
Purging configuration files for autoconf ...
Removing m4 ...
Removing gettext ...
Removing libjaxp1.3-java ...
Removing libvorbis0a ...
Purging configuration files for libvorbis0a ...
Removing libhtml-tree-perl ...
Removing libcroco3 ...
Purging configuration files for libcroco3 ...
Removing libogg0 ...
Purging configuration files for libogg0 ...
Removing gettext-base ...
Removing libhtml-parser-perl ...
Removing libhtml-tagset-perl ...
Removing liburi-perl ...
Removing ca-certificates-java ...
Purging configuration files for ca-certificates-java ...
Removing rhino ...
Removing gcj-4.4-jdk ...
install-info: warning: maintainer scripts should not call install-info anymore,
install-info: warning: this is handled now by a dpkg trigger provided by the
install-info: warning: install-info package; package gcj-4.4-jdk should be updated.
Removing libjline-java ...
Removing libgcj10-dev ...
Removing openjdk-6-jre-headless ...
update-alternatives: using /usr/bin/gij-4.4 to provide /usr/bin/java (java) in auto mode.
update-alternatives: using /usr/bin/gkeytool-4.4 to provide /usr/bin/keytool (keytool) in auto mode.
update-alternatives: using /usr/bin/grmid-4.4 to provide /usr/bin/rmid (rmid) in auto mode.
update-alternatives: using /usr/bin/grmiregistry-4.4 to provide /usr/bin/rmiregistry (rmiregistry) in auto mode.
update-alternatives: using /usr/bin/gorbd-4.4 to provide /usr/bin/orbd (orbd) in auto mode.
Purging configuration files for openjdk-6-jre-headless ...
Removing liblcms1 ...
Purging configuration files for liblcms1 ...
Removing gcj-4.4-jre ...
Removing zlib1g-dev ...
Removing openjdk-6-jre-lib ...
Removing libgcj10-awt ...
Removing libantlr-java ...
Removing libecj-java-gcj ...
gcj-dbtool-4.4 succeeded unexpectedly
Purging configuration files for libecj-java-gcj ...
Removing fastjar ...
Removing libxtst6 ...
Purging configuration files for libxtst6 ...
Removing tzdata-java ...
Removing ecj1 ...
Removing ecj-gcj ...
Removing libgcj-bc ...
Removing libgtk2.0-0 ...
Purging configuration files for libgtk2.0-0 ...
Removing libnss3-1d ...
Purging configuration files for libnss3-1d ...
Removing libxrandr2 ...
Purging configuration files for libxrandr2 ...
Removing libtiff4 ...
Purging configuration files for libtiff4 ...
Removing libxcomposite1 ...
Purging configuration files for libxcomposite1 ...
Removing shared-mime-info ...
Purging configuration files for shared-mime-info ...
dpkg - warning: while removing shared-mime-info, directory `/usr/share/mime' not empty so not removed.
Removing ecj ...
Removing libpango1.0-0 ...
Purging configuration files for libpango1.0-0 ...
Removing libgtk2.0-common ...
Removing libsm6 ...
Purging configuration files for libsm6 ...
Removing libecj-java ...
Removing java-common ...
Removing libcairo2 ...
Purging configuration files for libcairo2 ...
Removing libxi6 ...
Purging configuration files for libxi6 ...
Removing libxcursor1 ...
Purging configuration files for libxcursor1 ...
Removing libjasper1 ...
Purging configuration files for libjasper1 ...
Removing libnspr4-0d ...
Purging configuration files for libnspr4-0d ...
Removing libpango1.0-common ...
Purging font configuration of pango...
Purging category xfont..
Purging configuration files for libpango1.0-common ...
Removing libxdamage1 ...
Purging configuration files for libxdamage1 ...
Removing libxcb-render-util0 ...
Purging configuration files for libxcb-render-util0 ...
Removing libxml2 ...
Purging configuration files for libxml2 ...
Removing libice6 ...
Purging configuration files for libice6 ...
Removing libcups2 ...
Purging configuration files for libcups2 ...
Removing libxft2 ...
Purging configuration files for libxft2 ...
Removing libxinerama1 ...
Purging configuration files for libxinerama1 ...
Removing gcj-4.4-jre-lib ...
Removing fontconfig ...
Purging font configuration of fontconfig...
Purging category cid..
Purging category truetype..
Purging category type1..
Updating fontconfig cache for /usr/share/fonts/truetype/ttf-dejavu
Purging configuration files for fontconfig ...
Removing gcj-4.4-jre-headless ...
Purging configuration files for gcj-4.4-jre-headless ...
Removing libatk1.0-0 ...
Purging configuration files for libatk1.0-0 ...
Removing libthai0 ...
Purging configuration files for libthai0 ...
Removing libxfixes3 ...
Purging configuration files for libxfixes3 ...
Removing libdirectfb-1.2-0 ...
Purging configuration files for libdirectfb-1.2-0 ...
Removing libpng12-0 ...
Purging configuration files for libpng12-0 ...
Removing libpixman-1-0 ...
Purging configuration files for libpixman-1-0 ...
Removing libxcb-render0 ...
Purging configuration files for libxcb-render0 ...
Removing libjpeg62 ...
Removing libfontconfig1 ...
Purging configuration files for libfontconfig1 ...
Removing libglib2.0-0 ...
Purging configuration files for libglib2.0-0 ...
Removing libgcj10 ...
rmdir: failed to remove `/var/lib/gcj-4.4': No such file or directory
Purging configuration files for libgcj10 ...
rmdir: failed to remove `/var/lib/gcj-4.4': No such file or directory
Removing libthai-data ...
Removing libavahi-client3 ...
Purging configuration files for libavahi-client3 ...
Removing libxrender1 ...
Purging configuration files for libxrender1 ...
Removing libdatrie1 ...
Purging configuration files for libdatrie1 ...
Removing libxext6 ...
Purging configuration files for libxext6 ...
Removing libsysfs2 ...
Purging configuration files for libsysfs2 ...
Removing libpcre3 ...
Purging configuration files for libpcre3 ...
Removing libfreetype6 ...
Purging configuration files for libfreetype6 ...
Removing libexpat1 ...
Purging configuration files for libexpat1 ...
Removing libgcj-common ...
Purging configuration files for libgcj-common ...
Removing libts-0.0-0 ...
Purging configuration files for libts-0.0-0 ...
Removing python-central ...
Purging configuration files for python-central ...
Removing libavahi-common3 ...
Purging configuration files for libavahi-common3 ...
Removing fontconfig-config ...
Purging configuration files for fontconfig-config ...
Removing ttf-dejavu ...
Removing x11-common ...
Purging configuration files for x11-common ...
dpkg - warning: while removing x11-common, directory `/etc/X11' not empty so not removed.
Removing gcj-4.4-base ...
Removing libx11-6 ...
Purging configuration files for libx11-6 ...
Removing tsconf ...
Purging configuration files for tsconf ...
Removing ttf-dejavu-extra ...
Purging configuration files for ttf-dejavu-extra ...
Removing libavahi-common-data ...
Removing ttf-dejavu-core ...
Purging configuration files for ttf-dejavu-core ...
Removing libxcb1 ...
Purging configuration files for libxcb1 ...
Removing python ...
Purging configuration files for python ...
Removing libxau6 ...
Purging configuration files for libxau6 ...
Removing libxdmcp6 ...
Purging configuration files for libxdmcp6 ...
Removing ucf ...
Purging configuration files for ucf ...
Removing libx11-data ...
Removing python2.6 ...
Purging configuration files for python2.6 ...
Removing libsqlite3-0 ...
Purging configuration files for libsqlite3-0 ...
Removing libncursesw5 ...
Purging configuration files for libncursesw5 ...
Removing defoma ...
Purging configuration files for defoma ...
Removing mime-support ...
Purging configuration files for mime-support ...
Removing whiptail ...
Removing file ...
Purging configuration files for file ...
Removing libnewt0.52 ...
Purging configuration files for libnewt0.52 ...
Removing libpopt0 ...
Purging configuration files for libpopt0 ...
Removing libmagic1 ...
Purging configuration files for libmagic1 ...
Processing triggers for libc-bin ...
ldconfig deferred processing now taking place
******************************************************************************
Finished at 20091022-2157
Build needed 03:03:45, 203280k disk space
More information about the ubuntu-autotest
mailing list