Log for failed build of apport-symptoms_0.2 (dist=karmic-autotest)

Build Daemon user noreply at buildd.ubuntu.com
Tue Oct 6 08:48:36 BST 2009


Automatic build of apport-symptoms_0.2 on terranova by sbuild/i386 1.170.5
Build started at 20091006-0848
******************************************************************************
Checking available source versions...
Fetching source files...
Reading package lists...
Building dependency tree...
Reading state information...
NOTICE: 'apport-symptoms' packaging is maintained in the 'Bzr' version control system at:
https://code.launchpad.net/~ubuntu-dev/apport/apport-symptoms
Please use:
bzr get https://code.launchpad.net/~ubuntu-dev/apport/apport-symptoms
to retrieve the latest (possible unreleased) updates to the package.
Need to get 10.1kB of source archives.
Get:1 http://archive.internal karmic-autotest/main apport-symptoms 0.2 (dsc) [848B]
Get:2 http://archive.internal karmic-autotest/main apport-symptoms 0.2 (tar) [9284B]
Fetched 10.1kB in 0s (666kB/s)
Download complete and in download only mode
** Using build dependencies supplied by package:
Build-Depends: debhelper (>= 7)
Checking for already installed source dependencies...
debhelper: missing
Checking for source dependency conflicts...
  /usr/bin/sudo /usr/bin/apt-get --purge $CHROOT_OPTIONS -q -y install debhelper
Reading package lists...
Building dependency tree...
Reading state information...
The following extra packages will be installed:
  bsdmainutils file gettext gettext-base groff-base html2text intltool-debian
  libcroco3 libglib2.0-0 libmagic1 libpcre3 libxml2 man-db po-debconf
Suggested packages:
  wamerican wordlist whois vacation dh-make cvs gettext-doc groff less
  www-browser libmail-box-perl
Recommended packages:
  curl wget lynx libglib2.0-data shared-mime-info xml-core
  libmail-sendmail-perl
The following NEW packages will be installed:
  bsdmainutils debhelper file gettext gettext-base groff-base html2text
  intltool-debian libcroco3 libglib2.0-0 libmagic1 libpcre3 libxml2 man-db
  po-debconf
0 upgraded, 15 newly installed, 0 to remove and 1 not upgraded.
Need to get 0B/7710kB of archives.
After this operation, 25.7MB of additional disk space will be used.
WARNING: The following packages cannot be authenticated!
  libmagic1 file libpcre3 libglib2.0-0 libxml2 bsdmainutils gettext-base
  groff-base man-db html2text libcroco3 gettext intltool-debian po-debconf
  debhelper
debconf: unable to initialize frontend: Dialog
debconf: (Dialog frontend will not work on a dumb terminal, an emacs shell buffer, or without a controlling terminal.)
debconf: falling back to frontend: Readline
debconf: unable to initialize frontend: Readline
debconf: (This frontend requires a controlling tty.)
debconf: falling back to frontend: Teletype
dpkg-preconfigure: unable to re-open stdin: 
Authentication warning overridden.
Selecting previously deselected package libmagic1.
(Reading database ... 10863 files and directories currently installed.)
Unpacking libmagic1 (from .../libmagic1_5.03-1ubuntu1_i386.deb) ...
Selecting previously deselected package file.
Unpacking file (from .../file_5.03-1ubuntu1_i386.deb) ...
Selecting previously deselected package libpcre3.
Unpacking libpcre3 (from .../libpcre3_7.8-2ubuntu1_i386.deb) ...
Selecting previously deselected package libglib2.0-0.
Unpacking libglib2.0-0 (from .../libglib2.0-0_2.22.1-0ubuntu1_i386.deb) ...
Selecting previously deselected package libxml2.
Unpacking libxml2 (from .../libxml2_2.7.3.dfsg-1ubuntu2_i386.deb) ...
Selecting previously deselected package bsdmainutils.
Unpacking bsdmainutils (from .../bsdmainutils_6.1.10ubuntu4_i386.deb) ...
Selecting previously deselected package gettext-base.
Unpacking gettext-base (from .../gettext-base_0.17-6ubuntu2_i386.deb) ...
Selecting previously deselected package groff-base.
Unpacking groff-base (from .../groff-base_1.20.1-5_i386.deb) ...
Selecting previously deselected package man-db.
Unpacking man-db (from .../man-db_2.5.6-2_i386.deb) ...
Selecting previously deselected package html2text.
Unpacking html2text (from .../html2text_1.3.2a-14_i386.deb) ...
Selecting previously deselected package libcroco3.
Unpacking libcroco3 (from .../libcroco3_0.6.1-2_i386.deb) ...
Selecting previously deselected package gettext.
Unpacking gettext (from .../gettext_0.17-6ubuntu2_i386.deb) ...
Selecting previously deselected package intltool-debian.
Unpacking intltool-debian (from .../intltool-debian_0.35.0+20060710.1_all.deb) ...
Selecting previously deselected package po-debconf.
Unpacking po-debconf (from .../po-debconf_1.0.16_all.deb) ...
Selecting previously deselected package debhelper.
Unpacking debhelper (from .../debhelper_7.3.15ubuntu3_all.deb) ...
Setting up libmagic1 (5.03-1ubuntu1) ...

Setting up file (5.03-1ubuntu1) ...
Setting up libpcre3 (7.8-2ubuntu1) ...

Setting up libglib2.0-0 (2.22.1-0ubuntu1) ...

Setting up libxml2 (2.7.3.dfsg-1ubuntu2) ...

Setting up bsdmainutils (6.1.10ubuntu4) ...
update-alternatives: using /usr/bin/bsd-write to provide /usr/bin/write (write) in auto mode.

Setting up gettext-base (0.17-6ubuntu2) ...

Setting up groff-base (1.20.1-5) ...

Setting up man-db (2.5.6-2) ...
Building database of manual pages ...
... skipping, since this is a buildd

Setting up html2text (1.3.2a-14) ...

Setting up libcroco3 (0.6.1-2) ...

Setting up gettext (0.17-6ubuntu2) ...
install-info: warning: maintainer scripts should not call install-info anymore,
install-info: warning: this is handled now by a dpkg trigger provided by the
install-info: warning: install-info package; package gettext should be updated.

Setting up intltool-debian (0.35.0+20060710.1) ...
Setting up po-debconf (1.0.16) ...
Setting up debhelper (7.3.15ubuntu3) ...
Processing triggers for libc-bin ...
ldconfig deferred processing now taking place
Checking correctness of source dependencies...
Toolchain package versions: libc6-dev_2.10.1-0ubuntu13 make_3.81-6 dpkg-dev_1.15.4ubuntu2 linux-libc-dev_2.6.31-11.38 g++-4.4_4.4.1-4ubuntu6 gcc-4.4_4.4.1-4ubuntu6 binutils_2.19.91.20091001-0ubuntu2 libstdc++6_4.4.1-4ubuntu6 libstdc++6-4.4-dev_4.4.1-4ubuntu6
------------------------------------------------------------------------------
sh: gcc: not found
dpkg-source: warning: Couldn't determine gcc system type, falling back to default (native compilation)
gpg: Signature made Wed Aug  5 18:40:58 2009 BST using DSA key ID 5E0577F2
gpg: Can't check signature: public key not found
dpkg-source: extracting apport-symptoms in apport-symptoms-0.2
dpkg-source: unpacking apport-symptoms_0.2.tar.gz
dpkg-buildpackage: set CFLAGS to default value: -g -O2
dpkg-buildpackage: set CPPFLAGS to default value: 
dpkg-buildpackage: set LDFLAGS to default value: -Wl,-Bsymbolic-functions
dpkg-buildpackage: set FFLAGS to default value: -g -O2
dpkg-buildpackage: set CXXFLAGS to default value: -g -O2
dpkg-buildpackage: source package apport-symptoms
dpkg-buildpackage: source version 0.2
dpkg-buildpackage: host architecture i386
 /usr/bin/fakeroot debian/rules clean
dh clean
   dh_testdir
   dh_auto_clean
   dh_clean
 debian/rules build
dh build
   dh_testdir
   dh_auto_configure
   dh_auto_build
make[1]: Entering directory `/build/buildd/apport-symptoms-0.2'
Nothing to do
make[1]: Leaving directory `/build/buildd/apport-symptoms-0.2'
   dh_auto_test
 /usr/bin/fakeroot debian/rules binary
dh binary
   dh_testroot
   dh_prep
   dh_installdirs
   dh_auto_install
make[1]: Entering directory `/build/buildd/apport-symptoms-0.2'
install -d /build/buildd/apport-symptoms-0.2/debian/apport-symptoms/usr/share/apport/symptoms
install -m 644 symptoms/*.py /build/buildd/apport-symptoms-0.2/debian/apport-symptoms/usr/share/apport/symptoms
make[1]: Leaving directory `/build/buildd/apport-symptoms-0.2'
   dh_install
   dh_installdocs
   dh_installchangelogs
   dh_installexamples
   dh_installman
   dh_installcatalogs
   dh_installcron
   dh_installdebconf
   dh_installcatalogs
   dh_installemacsen
   dh_installifupdown
   dh_installinfo
   dh_installinit
   dh_installmenu
   dh_installmime
   dh_installmodules
   dh_installlogcheck
   dh_installlogrotate
   dh_installpam
   dh_installppp
   dh_installudev
   dh_installwm
   dh_installxfonts
   dh_bugfiles
   dh_lintian
   dh_gconf
   dh_icons
   dh_perl
   dh_pysupport
Traceback (most recent call last):
  File "/usr/share/python-support/private/movemodules", line 9, in <module>
    from hashlib import md5
  File "/usr/lib/python2.6/hashlib.py", line 136, in <module>
    md5 = __get_builtin_constructor('md5')
  File "/usr/lib/python2.6/hashlib.py", line 63, in __get_builtin_constructor
    import _md5
ImportError: No module named _md5
dh_pysupport: /usr/share/python-support/private/movemodules returned exit code 1
make: *** [binary] Error 1
dpkg-buildpackage: error: /usr/bin/fakeroot debian/rules binary gave error exit status 2
******************************************************************************
Build finished at 20091006-0848
FAILED [dpkg-buildpackage died]
Purging chroot-karmic-autotest/build/buildd/apport-symptoms-0.2
------------------------------------------------------------------------------
  /usr/bin/sudo dpkg --root=/home/buildd/build-karmic-autotest/chroot-karmic-autotest --purge po-debconf intltool-debian groff-base libglib2.0-0 libcroco3 libmagic1 gettext file libxml2 bsdmainutils html2text libpcre3 gettext-base man-db debhelper
(Reading database ... 11956 files and directories currently installed.)
Removing debhelper ...
dpkg - warning: while removing debhelper, directory `/usr/share/perl5/Debian/Debhelper/Sequence' not empty so not removed.
dpkg - warning: while removing debhelper, directory `/usr/share/perl5/Debian/Debhelper' not empty so not removed.
dpkg - warning: while removing debhelper, directory `/usr/share/debhelper/autoscripts' not empty so not removed.
dpkg - warning: while removing debhelper, directory `/usr/share/debhelper' not empty so not removed.
Removing po-debconf ...
Removing intltool-debian ...
Removing gettext ...
install-info: warning: maintainer scripts should not call install-info anymore,
install-info: warning: this is handled now by a dpkg trigger provided by the
install-info: warning: install-info package; package gettext should be updated.
Removing file ...
Purging configuration files for file ...
Removing html2text ...
Purging configuration files for html2text ...
Removing gettext-base ...
Removing man-db ...
Purging configuration files for man-db ...
  Removing catpages as well as /var/cache/man hierarchy.
dpkg - warning: while removing man-db, directory `/usr/lib/man-db' not empty so not removed.
dpkg - warning: while removing man-db, directory `/usr/share/bug/man-db' not empty so not removed.
dpkg - warning: while removing man-db, directory `/usr/share/doc/man-db/examples' not empty so not removed.
dpkg - warning: while removing man-db, directory `/usr/share/doc/man-db' not empty so not removed.
dpkg - warning: while removing man-db, directory `/usr/share/man/id/man5' not empty so not removed.
dpkg - warning: while removing man-db, directory `/usr/share/man-db' not empty so not removed.
Removing groff-base ...
Purging configuration files for groff-base ...
Removing libcroco3 ...
Purging configuration files for libcroco3 ...
Removing libmagic1 ...
Purging configuration files for libmagic1 ...
Removing libxml2 ...
Purging configuration files for libxml2 ...
Removing bsdmainutils ...
Purging configuration files for bsdmainutils ...
Removing libglib2.0-0 ...
Purging configuration files for libglib2.0-0 ...
Removing libpcre3 ...
Purging configuration files for libpcre3 ...
Processing triggers for libc-bin ...
ldconfig deferred processing now taking place
******************************************************************************
Finished at 20091006-0848
Build needed 00:00:06, 108k disk space




More information about the ubuntu-autotest mailing list